Tasks


Page 78/85. Records 3851 - 3900 of 4215.
ID Method Owner State Label Worker Created Finished Subtask #
3064 VersionDiffBuild packit FAILED python-scikit-build-core-0.9.8-1.20240805071341541856.pr848.40.g68306ba.src.rpm 2024-08-05 09:18:53 2024-08-05 09:25:47 1
3062 VersionDiffBuild packit FAILED spglib-2.5.0-1.20240805065236715840.pr519.5.g643a895.src.rpm 2024-08-05 08:56:56 2024-08-05 09:04:19 1
3046 VersionDiffBuild packit FAILED test-autorestic-1.7.11-1.src.rpm 2024-08-05 06:58:05 2024-08-05 07:02:56 1
3045 VersionDiffBuild packit FAILED test-autorestic-1.7.11-1.src.rpm 2024-08-05 06:58:04 2024-08-05 07:01:06 1
3044 VersionDiffBuild packit FAILED test-autorestic-1.7.11-1.src.rpm 2024-08-05 06:57:14 2024-08-05 07:04:25 1
3043 VersionDiffBuild packit FAILED test-fzf-0.46.1-1.src.rpm 2024-08-05 06:56:56 2024-08-05 07:01:15 1
3041 VersionDiffBuild packit FAILED test-fzf-0.46.1-1.src.rpm 2024-08-05 06:56:40 2024-08-05 07:04:26 1
3040 VersionDiffBuild packit FAILED test-fzf-0.46.1-1.src.rpm 2024-08-05 06:56:33 2024-08-05 07:03:08 1
3039 VersionDiffBuild packit FAILED go-vendor-tools-0.5.1^11.20240805.fc35cd9-1.src.rpm 2024-08-05 06:55:29 2024-08-05 07:02:56 1
3038 VersionDiffBuild packit FAILED go-vendor-tools-0.5.1^11.20240805.fc35cd9-1.src.rpm 2024-08-05 06:54:53 2024-08-05 06:58:56 1
3037 VersionDiffBuild packit FAILED go-vendor-tools-0.5.1^11.20240805.fc35cd9-1.src.rpm 2024-08-05 06:54:49 2024-08-05 07:01:38 1
3016 VersionDiffBuild packit FAILED spglib-2.5.0-1.20240804183416817483.pr466.7.g3db26ef.src.rpm 2024-08-04 20:37:58 2024-08-04 20:44:34 1
3013 VersionDiffBuild packit FAILED spglib-2.5.0-1.20240804175755177348.pr466.6.g8b07ece.src.rpm 2024-08-04 20:01:49 2024-08-04 20:08:41 1
3012 VersionDiffBuild packit FAILED spglib-2.5.0-1.20240804175755177348.pr466.6.g8b07ece.src.rpm 2024-08-04 20:01:48 2024-08-04 20:08:42 1
3010 VersionDiffBuild packit FAILED spglib-2.5.0-1.20240804175235313662.pr520.10.g0acf60a.src.rpm 2024-08-04 19:56:09 2024-08-04 20:03:23 1
3008 VersionDiffBuild packit FAILED spglib-2.5.0-1.20240804171811634083.pr521.4.g7d4e17f.src.rpm 2024-08-04 19:22:11 2024-08-04 19:28:21 1
2996 VersionDiffBuild packit FAILED tmt-1.35.dev888-1.20240803105318151435.pr2689.86.g9858e1d6.src.rpm 2024-08-03 12:55:15 2024-08-03 13:02:11 1
2995 VersionDiffBuild packit FAILED tmt-1.35.dev888-1.20240803105047255989.pr2689.86.g9858e1d6.src.rpm 2024-08-03 12:52:18 2024-08-03 12:58:50 1
2982 VersionDiffBuild packit FAILED tmt-1.35.dev888-1.20240803072939626902.pr3040.85.g23e5ce7b.src.rpm 2024-08-03 09:31:46 2024-08-03 09:34:15 1
2981 VersionDiffBuild packit FAILED tmt-1.35.dev888-1.20240803072540383338.pr2689.85.g2b681aaf.src.rpm 2024-08-03 09:27:56 2024-08-03 09:38:59 1
2980 VersionDiffBuild packit FAILED tmt-1.35.dev888-1.20240803072559487473.pr2689.85.g2b681aaf.src.rpm 2024-08-03 09:27:48 2024-08-03 09:33:47 1
2979 VersionDiffBuild packit FAILED tmt-1.35.dev888-1.20240803072540383338.pr2689.85.g2b681aaf.src.rpm 2024-08-03 09:27:45 2024-08-03 09:34:15 1
2977 VersionDiffBuild packit FAILED python-scikit-build-core-0.9.8-1.20240803032537329518.pr846.40.ge2dda90.src.rpm 2024-08-03 05:30:30 2024-08-03 05:37:36 1
2975 VersionDiffBuild packit FAILED python-scikit-build-core-0.9.8-1.20240803025334199827.pr846.39.g9627870.src.rpm 2024-08-03 04:58:20 2024-08-03 05:05:06 1
2973 VersionDiffBuild packit FAILED netavark-1.12.1-1.20240802222413571596.pr1046.5.g748908a.src.rpm 2024-08-03 00:38:09 2024-08-03 00:45:20 1
2970 VersionDiffBuild packit FAILED tmt-1.35.dev888-1.20240802214037835223.pr3036.83.g95042d0f.src.rpm 2024-08-02 23:42:45 2024-08-02 23:49:16 1
2969 VersionDiffBuild packit FAILED tmt-1.35.dev888-1.20240802214037835223.pr3036.83.g95042d0f.src.rpm 2024-08-02 23:42:38 2024-08-02 23:49:44 1
2962 VersionDiffBuild packit FAILED python-scikit-build-core-0.9.8-1.20240802193250896003.pr845.37.g845fd33.src.rpm 2024-08-02 21:37:00 2024-08-02 21:39:09 1
2961 VersionDiffBuild packit FAILED python-scikit-build-core-0.9.8-1.20240802192804507524.pr845.37.g74661d1.src.rpm 2024-08-02 21:32:43 2024-08-02 21:43:49 1
2958 VersionDiffBuild packit FAILED tmt-1.35.dev888-1.20240802190838622409.pr3127.82.g3dd53c75.src.rpm 2024-08-02 21:13:52 2024-08-02 21:20:47 1
2957 VersionDiffBuild packit FAILED python-scikit-build-core-0.9.8-1.20240802190903127799.pr845.37.g5905899.src.rpm 2024-08-02 21:13:44 2024-08-02 21:20:28 1
2955 VersionDiffBuild packit FAILED python-scikit-build-core-0.9.8-1.20240802175846298592.pr844.36.gb210c4e.src.rpm 2024-08-02 20:03:27 2024-08-02 20:09:31 1
2948 VersionDiffBuild packit FAILED python-scikit-build-core-0.9.8-1.20240802174312870366.pr842.36.ga7bc9c4.src.rpm 2024-08-02 19:47:50 2024-08-02 19:54:43 1
2947 VersionDiffBuild packit FAILED tmt-1.35.dev888-1.20240802174411815099.pr3017.84.g9b75f55a.src.rpm 2024-08-02 19:46:17 2024-08-02 19:52:55 1
2941 VersionDiffBuild packit FAILED python-podman-5.2.0-1.20240802162005727644.pr389.3.gd75bb7c.src.rpm 2024-08-02 18:21:43 2024-08-02 18:27:46 1
2923 VersionDiffBuild packit FAILED python-scikit-build-core-0.9.8-1.20240802144820849932.pr842.33.g19d444f.src.rpm 2024-08-02 16:53:14 2024-08-02 16:59:43 1
2911 VersionDiffBuild packit FAILED python-podman-5.2.0-1.20240802140719498043.pr416.1.g3eabadd.src.rpm 2024-08-02 16:09:04 2024-08-02 16:16:59 1
2908 VersionDiffBuild packit FAILED python-podman-5.2.0-1.20240802135928754638.pr389.1.g5df93eb.src.rpm 2024-08-02 16:01:21 2024-08-02 16:07:58 1
2904 VersionDiffBuild packit FAILED tmt-1.35.dev888-1.20240802134109233499.pr3127.80.g52829793.src.rpm 2024-08-02 15:44:08 2024-08-02 15:49:38 1
2902 VersionDiffBuild packit FAILED tmt-1.35.dev888-1.20240802134101803261.pr3127.80.g52829793.src.rpm 2024-08-02 15:43:19 2024-08-02 15:50:38 1
2899 VersionDiffBuild packit FAILED python-podman-5.2.0-1.20240802133602841264.pr415.2.g68d330f.src.rpm 2024-08-02 15:38:24 2024-08-02 15:44:16 1
2888 VersionDiffBuild packit FAILED python-podman-5.1.0-1.20240802131343971062.pr414.3.gffdf599.src.rpm 2024-08-02 15:15:02 2024-08-02 15:19:09 1
2884 VersionDiffBuild packit FAILED tmt-1.35.dev888-1.20240802130243934751.pr3037.82.g7d6e4e49.src.rpm 2024-08-02 15:06:27 2024-08-02 15:12:58 1
2881 VersionDiffBuild packit FAILED conmon-rs-0.6.3-1.20240802123324839529.pr2365.308.gccb3270.src.rpm 2024-08-02 14:43:46 2024-08-02 14:52:15 1
2877 VersionDiffBuild packit FAILED tmt-1.35.dev888-1.20240802123040280201.pr2816.85.g3ccefe40.src.rpm 2024-08-02 14:32:47 2024-08-02 14:40:04 1
2874 VersionDiffBuild packit FAILED conmon-rs-0.6.3-1.20240802120011370847.pr2364.304.gaa19f98.src.rpm 2024-08-02 14:13:43 2024-08-02 14:20:44 1
2872 VersionDiffBuild packit FAILED conmon-rs-0.6.3-1.20240802120018088457.pr2363.304.g5dedf2d.src.rpm 2024-08-02 14:10:43 2024-08-02 14:17:54 1
2871 VersionDiffBuild packit FAILED conmon-rs-0.6.3-1.20240802120214115954.pr2365.304.g6a24882.src.rpm 2024-08-02 14:08:50 2024-08-02 14:15:44 1
2866 VersionDiffBuild packit FAILED tmt-1.35.dev888-1.20240802115027340730.pr3123.80.g00fc68d9.src.rpm 2024-08-02 13:52:31 2024-08-02 13:55:13 1
2861 VersionDiffBuild packit FAILED tmt-1.35.dev888-1.20240802114541424073.pr3123.79.g0c4df92c.src.rpm 2024-08-02 13:48:20 2024-08-02 13:54:15 1
Page 78/85. Records 3851 - 3900 of 4215.