Task #1659 - stdout.log

back to task #1659
download
COMMAND: koji -p koji download-build --noprogress --arch=src mod_wsgi-5.0.0-1.fc40
-------------------------------------------------------------------------------
Downloading [1/1]: mod_wsgi-5.0.0-1.fc40.src.rpm
COMMAND: su - csmock --session-command 'cd /tmp/tmpnwuxjk25 && csmock -r fedora-41-x86_64 -t cppcheck,gcc,clang,shellcheck -o /tmp/tmpnwuxjk25/mod_wsgi-5.0.0-1.fc40.tar.xz --gcc-analyze /tmp/tmpnwuxjk25/mod_wsgi-5.0.0-1.fc40.src.rpm'
-------------------------------------------------------------------------------
scan.ini: [scan]
scan.ini: tool = csmock
scan.ini: tool-version = csmock-3.5.3-1.el9
scan.ini: tool-args = '/usr/bin/csmock' '-r' 'fedora-41-x86_64' '-t' 'cppcheck,gcc,clang,shellcheck' '-o' '/tmp/tmpnwuxjk25/mod_wsgi-5.0.0-1.fc40.tar.xz' '--gcc-analyze' '/tmp/tmpnwuxjk25/mod_wsgi-5.0.0-1.fc40.src.rpm'
scan.ini: host = ip-172-16-1-201.us-west-2.compute.internal
scan.ini: store-results-to = /tmp/tmpnwuxjk25/mod_wsgi-5.0.0-1.fc40.tar.xz
scan.ini: time-created = 2024-07-03 16:12:44
scan.ini: enabled-plugins = clang, cppcheck, gcc, shellcheck
scan.ini: mock-config = fedora-41-x86_64
scan.ini: project-name = mod_wsgi-5.0.0-1.fc40
>>> 2024-07-03 16:12:44	"rpm -qa | sort -V > '/tmp/csmock3_58cvwq/mod_wsgi-5.0.0-1.fc40/debug/rpm-list-host.txt'"

>>> 2024-07-03 16:12:44	"/usr/bin/mock" "-r" "fedora-41-x86_64" "--plugin-option=tmpfs:keep_mounted=True" "--config-opts=print_main_output=True" "--init"
INFO: mock.py version 5.6 starting (python version = 3.9.19, NVR = mock-5.6-1.el9), args: /usr/libexec/mock/mock -r fedora-41-x86_64 --plugin-option=tmpfs:keep_mounted=True --config-opts=print_main_output=True --init
Start(bootstrap): init plugins
INFO: selinux enabled
Finish(bootstrap): init plugins
Start: init plugins
INFO: selinux enabled
Finish: init plugins
INFO: Signal handler active
Start: run
Start: clean chroot
Finish: clean chroot
Mock Version: 5.6
INFO: Mock Version: 5.6
Start(bootstrap): chroot init
INFO: calling preinit hooks
INFO: enabled root cache
INFO: enabled package manager cache
Start(bootstrap): cleaning package manager metadata
Finish(bootstrap): cleaning package manager metadata
INFO: Guessed host environment type: unknown
INFO: Using bootstrap image: registry.fedoraproject.org/fedora:rawhide
INFO: Pulling image: registry.fedoraproject.org/fedora:rawhide
INFO: Copy content of container registry.fedoraproject.org/fedora:rawhide to /var/lib/mock/fedora-rawhide-x86_64-bootstrap/root
INFO: Checking that registry.fedoraproject.org/fedora:rawhide image matches host's architecture
INFO: mounting registry.fedoraproject.org/fedora:rawhide with podman image mount
INFO: image registry.fedoraproject.org/fedora:rawhide as /var/lib/containers/storage/overlay/a28d7f1bf08b024e1b6575a0cbb5ffd172ad8b83c1573f9fc010d772c62e430f/merged
INFO: umounting image registry.fedoraproject.org/fedora:rawhide (/var/lib/containers/storage/overlay/a28d7f1bf08b024e1b6575a0cbb5ffd172ad8b83c1573f9fc010d772c62e430f/merged) with podman image umount
INFO: Package manager dnf5 detected and used (fallback)
INFO: Bootstrap image not marked ready
Start(bootstrap): installing dnf5 tooling
Updating and loading repositories:
 fedora                                 100% |  29.7 MiB/s |  21.1 MiB |  00m01s
Repositories loaded.
Package "dnf5-5.2.3.0-3.fc41.x86_64" is already installed.
Package "dnf5-plugins-5.2.3.0-3.fc41.x86_64" is already installed.

Nothing to do.
Finish(bootstrap): installing dnf5 tooling
Start(bootstrap): creating root cache
Finish(bootstrap): creating root cache
Finish(bootstrap): chroot init
Start: chroot init
INFO: calling preinit hooks
INFO: enabled root cache
INFO: enabled package manager cache
Start: cleaning package manager metadata
Finish: cleaning package manager metadata
INFO: enabled HW Info plugin
INFO: Package manager dnf5 detected and used (direct choice)
Start: installing minimal buildroot with dnf5
Updating and loading repositories:
 fedora                                 100% |  30.3 MiB/s |  21.1 MiB |  00m01s
Repositories loaded.
Package                            Arch   Version                    Repository      Size
Installing group/module packages:
 bash                              x86_64 5.2.26-3.fc40              fedora       8.1 MiB
 bzip2                             x86_64 1.0.8-18.fc40              fedora      91.7 KiB
 coreutils                         x86_64 9.5-2.fc41                 fedora       5.5 MiB
 cpio                              x86_64 2.15-1.fc40                fedora       1.1 MiB
 diffutils                         x86_64 3.10-5.fc40                fedora       1.6 MiB
 fedora-release-common             noarch 41-0.14                    fedora      19.2 KiB
 findutils                         x86_64 1:4.10.0-2.fc41            fedora       1.8 MiB
 gawk                              x86_64 5.3.0-3.fc40               fedora       1.7 MiB
 glibc-minimal-langpack            x86_64 2.39.9000-26.fc41          fedora       0.0   B
 grep                              x86_64 3.11-8.fc41                fedora       1.0 MiB
 gzip                              x86_64 1.13-1.fc40                fedora     385.0 KiB
 info                              x86_64 7.1-2.fc40                 fedora     357.8 KiB
 patch                             x86_64 2.7.6-24.fc40              fedora     262.8 KiB
 redhat-rpm-config                 noarch 293-1.fc41                 fedora     183.5 KiB
 rpm-build                         x86_64 4.19.92-1.fc41             fedora     194.2 KiB
 sed                               x86_64 4.9-1.fc40                 fedora     861.5 KiB
 shadow-utils                      x86_64 2:4.15.1-5.fc41            fedora       4.1 MiB
 tar                               x86_64 2:1.35-3.fc40              fedora       2.9 MiB
 unzip                             x86_64 6.0-63.fc40                fedora     382.8 KiB
 util-linux                        x86_64 2.40.1-2.fc41              fedora       3.7 MiB
 which                             x86_64 2.21-41.fc40               fedora      80.2 KiB
 xz                                x86_64 1:5.6.2-1.fc41             fedora       1.2 MiB
Installing dependencies:
 add-determinism                   x86_64 0.3.3-1.fc41               fedora       2.3 MiB
 alternatives                      x86_64 1.28-1.fc41                fedora      66.3 KiB
 ansible-srpm-macros               noarch 1-15.fc41                  fedora      35.7 KiB
 audit-libs                        x86_64 4.0.1-3.fc41               fedora     327.3 KiB
 authselect                        x86_64 1.5.0-5.fc41               fedora     153.6 KiB
 authselect-libs                   x86_64 1.5.0-5.fc41               fedora     818.2 KiB
 basesystem                        noarch 11-20.fc40                 fedora       0.0   B
 binutils                          x86_64 2.42.50-14.fc41            fedora      26.7 MiB
 build-reproducibility-srpm-macros noarch 0.3.3-1.fc41               fedora     735.0   B
 bzip2-libs                        x86_64 1.0.8-18.fc40              fedora      80.7 KiB
 ca-certificates                   noarch 2024.2.68_v8.0.302-2.fc41  fedora       2.3 MiB
 coreutils-common                  x86_64 9.5-2.fc41                 fedora      11.2 MiB
 cracklib                          x86_64 2.9.11-5.fc40              fedora     238.9 KiB
 crypto-policies                   noarch 20240628-1.gitddd11d3.fc41 fedora     123.4 KiB
 curl                              x86_64 8.8.0-1.fc41               fedora     743.7 KiB
 cyrus-sasl-lib                    x86_64 2.1.28-24.fc41             fedora       2.3 MiB
 debugedit                         x86_64 5.0-16.fc41                fedora     199.3 KiB
 dwz                               x86_64 0.15-6.fc40                fedora     290.9 KiB
 ed                                x86_64 1.20.2-1.fc41              fedora     146.8 KiB
 efi-srpm-macros                   noarch 5-11.fc40                  fedora      40.1 KiB
 elfutils                          x86_64 0.191-7.fc41               fedora       2.5 MiB
 elfutils-debuginfod-client        x86_64 0.191-7.fc41               fedora      64.9 KiB
 elfutils-default-yama-scope       noarch 0.191-7.fc41               fedora       1.8 KiB
 elfutils-libelf                   x86_64 0.191-7.fc41               fedora       1.2 MiB
 elfutils-libs                     x86_64 0.191-7.fc41               fedora     646.1 KiB
 fedora-gpg-keys                   noarch 41-0.2                     fedora     124.7 KiB
 fedora-release                    noarch 41-0.14                    fedora       0.0   B
 fedora-release-identity-basic     noarch 41-0.14                    fedora     694.0   B
 fedora-repos                      noarch 41-0.2                     fedora       4.9 KiB
 fedora-repos-rawhide              noarch 41-0.2                     fedora       2.2 KiB
 file                              x86_64 5.45-6.fc41                fedora     103.5 KiB
 file-libs                         x86_64 5.45-6.fc41                fedora       9.9 MiB
 filesystem                        x86_64 3.18-9.fc41                fedora     106.0   B
 fonts-srpm-macros                 noarch 1:2.0.5-16.fc41            fedora      55.8 KiB
 forge-srpm-macros                 noarch 0.3.1-1.fc41               fedora      39.0 KiB
 fpc-srpm-macros                   noarch 1.3-12.fc40                fedora     144.0   B
 gdb-minimal                       x86_64 14.2-13.fc41               fedora      12.7 MiB
 gdbm                              x86_64 1:1.23-6.fc40              fedora     460.9 KiB
 gdbm-libs                         x86_64 1:1.23-6.fc40              fedora     121.9 KiB
 ghc-srpm-macros                   noarch 1.9.1-1.fc41               fedora     747.0   B
 glibc                             x86_64 2.39.9000-26.fc41          fedora       6.7 MiB
 glibc-common                      x86_64 2.39.9000-26.fc41          fedora       1.0 MiB
 glibc-gconv-extra                 x86_64 2.39.9000-26.fc41          fedora       7.8 MiB
 gmp                               x86_64 1:6.3.0-1.fc41             fedora     803.4 KiB
 gnat-srpm-macros                  noarch 6-5.fc40                   fedora       1.0 KiB
 go-srpm-macros                    noarch 3.6.0-1.fc41               fedora      60.8 KiB
 jansson                           x86_64 2.13.1-9.fc40              fedora      88.3 KiB
 kernel-srpm-macros                noarch 1.0-23.fc41                fedora       1.9 KiB
 keyutils-libs                     x86_64 1.6.3-3.fc40               fedora      54.4 KiB
 krb5-libs                         x86_64 1.21.2-5.fc40              fedora       2.3 MiB
 libacl                            x86_64 2.3.2-1.fc40               fedora      40.0 KiB
 libarchive                        x86_64 3.7.4-1.fc41               fedora     914.6 KiB
 libattr                           x86_64 2.5.2-3.fc40               fedora      28.5 KiB
 libblkid                          x86_64 2.40.1-2.fc41              fedora     258.5 KiB
 libbrotli                         x86_64 1.1.0-4.fc41               fedora     829.6 KiB
 libcap                            x86_64 2.70-2.fc41                fedora     220.2 KiB
 libcap-ng                         x86_64 0.8.5-2.fc41               fedora      69.2 KiB
 libcom_err                        x86_64 1.47.1-1.fc41              fedora      67.2 KiB
 libcurl                           x86_64 8.8.0-1.fc41               fedora     805.7 KiB
 libeconf                          x86_64 0.6.2-2.fc41               fedora      58.0 KiB
 libevent                          x86_64 2.1.12-13.fc41             fedora     895.6 KiB
 libfdisk                          x86_64 2.40.1-2.fc41              fedora     362.9 KiB
 libffi                            x86_64 3.4.6-1.fc41               fedora      82.4 KiB
 libgcc                            x86_64 14.1.1-6.fc41              fedora     274.6 KiB
 libgomp                           x86_64 14.1.1-6.fc41              fedora     523.4 KiB
 libidn2                           x86_64 2.3.7-1.fc40               fedora     329.1 KiB
 libmount                          x86_64 2.40.1-2.fc41              fedora     351.8 KiB
 libnghttp2                        x86_64 1.62.1-1.fc41              fedora     166.1 KiB
 libnsl2                           x86_64 2.0.1-1.fc40               fedora      57.9 KiB
 libpkgconf                        x86_64 2.1.1-1.fc41               fedora      74.2 KiB
 libpsl                            x86_64 0.21.5-3.fc40              fedora      80.5 KiB
 libpwquality                      x86_64 1.4.5-10.fc41              fedora     417.8 KiB
 libselinux                        x86_64 3.7-1.fc41                 fedora     181.0 KiB
 libsemanage                       x86_64 3.7-1.fc41                 fedora     293.5 KiB
 libsepol                          x86_64 3.7-1.fc41                 fedora     817.8 KiB
 libsmartcols                      x86_64 2.40.1-2.fc41              fedora     180.4 KiB
 libssh                            x86_64 0.10.6-6.fc41              fedora     513.3 KiB
 libssh-config                     noarch 0.10.6-6.fc41              fedora     277.0   B
 libstdc++                         x86_64 14.1.1-6.fc41              fedora       3.0 MiB
 libtasn1                          x86_64 4.19.0-6.fc40              fedora     175.7 KiB
 libtirpc                          x86_64 1.3.4-1.rc3.fc41           fedora     202.8 KiB
 libtool-ltdl                      x86_64 2.4.7-11.fc41              fedora      66.1 KiB
 libunistring                      x86_64 1.1-7.fc41                 fedora       1.7 MiB
 libutempter                       x86_64 1.2.1-13.fc40              fedora      57.7 KiB
 libuuid                           x86_64 2.40.1-2.fc41              fedora      37.4 KiB
 libverto                          x86_64 0.3.2-8.fc40               fedora      29.5 KiB
 libxcrypt                         x86_64 4.4.36-5.fc40              fedora     262.8 KiB
 libxml2                           x86_64 2.12.8-1.fc41              fedora       1.7 MiB
 libzstd                           x86_64 1.5.6-1.fc41               fedora     787.9 KiB
 lua-libs                          x86_64 5.4.6-5.fc40               fedora     281.1 KiB
 lua-srpm-macros                   noarch 1-13.fc40                  fedora       1.3 KiB
 lz4-libs                          x86_64 1.9.4-6.fc40               fedora     129.4 KiB
 mpfr                              x86_64 4.2.1-4.fc41               fedora     828.0 KiB
 ncurses-base                      noarch 6.4-12.20240127.fc40       fedora     326.2 KiB
 ncurses-libs                      x86_64 6.4-12.20240127.fc40       fedora     963.2 KiB
 ocaml-srpm-macros                 noarch 10-2.fc41                  fedora       1.9 KiB
 openblas-srpm-macros              noarch 2-17.fc41                  fedora     112.0   B
 openldap                          x86_64 2.6.8-3.fc41               fedora     640.3 KiB
 openssl-libs                      x86_64 1:3.2.2-3.fc41             fedora       7.8 MiB
 p11-kit                           x86_64 0.25.3-4.fc40              fedora       2.2 MiB
 p11-kit-trust                     x86_64 0.25.3-4.fc40              fedora     391.4 KiB
 package-notes-srpm-macros         noarch 0.5-11.fc40                fedora       1.6 KiB
 pam                               x86_64 1.6.1-3.fc41               fedora       1.8 MiB
 pam-libs                          x86_64 1.6.1-3.fc41               fedora     135.0 KiB
 pcre2                             x86_64 10.44-1.fc41               fedora     653.5 KiB
 pcre2-syntax                      noarch 10.44-1.fc41               fedora     251.6 KiB
 perl-srpm-macros                  noarch 1-55.fc41                  fedora     861.0   B
 pkgconf                           x86_64 2.1.1-1.fc41               fedora      82.9 KiB
 pkgconf-m4                        noarch 2.1.1-1.fc41               fedora      13.9 KiB
 pkgconf-pkg-config                x86_64 2.1.1-1.fc41               fedora     989.0   B
 popt                              x86_64 1.19-6.fc40                fedora     136.9 KiB
 publicsuffix-list-dafsa           noarch 20240107-3.fc40            fedora      67.5 KiB
 pyproject-srpm-macros             noarch 1.12.2-1.fc41              fedora       1.5 KiB
 python-srpm-macros                noarch 3.13-2.fc41                fedora      51.0 KiB
 qt5-srpm-macros                   noarch 5.15.14-1.fc41             fedora     500.0   B
 qt6-srpm-macros                   noarch 6.7.1-1.fc41               fedora     456.0   B
 readline                          x86_64 8.2-8.fc40                 fedora     489.2 KiB
 rpm                               x86_64 4.19.92-1.fc41             fedora       3.0 MiB
 rpm-build-libs                    x86_64 4.19.92-1.fc41             fedora     206.7 KiB
 rpm-libs                          x86_64 4.19.92-1.fc41             fedora     718.0 KiB
 rpm-sequoia                       x86_64 1.6.0-3.fc41               fedora       2.2 MiB
 rust-srpm-macros                  noarch 26.3-1.fc41                fedora       4.8 KiB
 setup                             noarch 2.15.0-4.fc41              fedora     720.7 KiB
 sqlite-libs                       x86_64 3.46.0-2.fc41              fedora       1.4 MiB
 systemd-libs                      x86_64 256.1-3.fc41               fedora       2.0 MiB
 util-linux-core                   x86_64 2.40.1-2.fc41              fedora       1.5 MiB
 xxhash-libs                       x86_64 0.8.2-2.fc40               fedora      88.5 KiB
 xz-libs                           x86_64 1:5.6.2-1.fc41             fedora     214.4 KiB
 zig-srpm-macros                   noarch 1-2.fc40                   fedora       1.1 KiB
 zip                               x86_64 3.0-40.fc40                fedora     703.2 KiB
 zlib-ng-compat                    x86_64 2.1.7-1.fc41               fedora     134.0 KiB
 zstd                              x86_64 1.5.6-1.fc41               fedora       1.7 MiB
Installing groups:
 Buildsystem building group                                                              

Transaction Summary:
 Installing:      154 packages

Total size of inbound packages is 53 MiB. Need to download 53 MiB.
After this operation 179 MiB will be used (install 179 MiB, remove 0 B).
[  1/154] bzip2-0:1.0.8-18.fc40.x86_64  100% |   1.4 MiB/s |  52.4 KiB |  00m00s
[  2/154] cpio-0:2.15-1.fc40.x86_64     100% |  12.4 MiB/s | 292.2 KiB |  00m00s
[  3/154] bash-0:5.2.26-3.fc40.x86_64   100% |  25.4 MiB/s |   1.8 MiB |  00m00s
[  4/154] diffutils-0:3.10-5.fc40.x86_6 100% |  28.3 MiB/s | 405.5 KiB |  00m00s
[  5/154] coreutils-0:9.5-2.fc41.x86_64 100% |  13.2 MiB/s |   1.1 MiB |  00m00s
[  6/154] fedora-release-common-0:41-0. 100% |   1.5 MiB/s |  22.3 KiB |  00m00s
[  7/154] findutils-1:4.10.0-2.fc41.x86 100% |  35.7 MiB/s | 548.3 KiB |  00m00s
[  8/154] glibc-minimal-langpack-0:2.39 100% |  10.4 MiB/s | 117.4 KiB |  00m00s
[  9/154] grep-0:3.11-8.fc41.x86_64     100% |  24.4 MiB/s | 299.3 KiB |  00m00s
[ 10/154] gzip-0:1.13-1.fc40.x86_64     100% |  16.7 MiB/s | 170.6 KiB |  00m00s
[ 11/154] info-0:7.1-2.fc40.x86_64      100% |  17.8 MiB/s | 182.3 KiB |  00m00s
[ 12/154] patch-0:2.7.6-24.fc40.x86_64  100% |  16.0 MiB/s | 130.7 KiB |  00m00s
[ 13/154] redhat-rpm-config-0:293-1.fc4 100% |   8.9 MiB/s |  82.0 KiB |  00m00s
[ 14/154] rpm-build-0:4.19.92-1.fc41.x8 100% |  10.1 MiB/s |  83.1 KiB |  00m00s
[ 15/154] sed-0:4.9-1.fc40.x86_64       100% |  28.3 MiB/s | 318.2 KiB |  00m00s
[ 16/154] shadow-utils-2:4.15.1-5.fc41. 100% |  73.3 MiB/s |   1.3 MiB |  00m00s
[ 17/154] tar-2:1.35-3.fc40.x86_64      100% |  34.9 MiB/s | 856.6 KiB |  00m00s
[ 18/154] unzip-0:6.0-63.fc40.x86_64    100% |   8.2 MiB/s | 184.5 KiB |  00m00s
[ 19/154] which-0:2.21-41.fc40.x86_64   100% |   3.4 MiB/s |  41.4 KiB |  00m00s
[ 20/154] xz-1:5.6.2-1.fc41.x86_64      100% |  46.0 MiB/s | 471.3 KiB |  00m00s
[ 21/154] gawk-0:5.3.0-3.fc40.x86_64    100% |  67.0 MiB/s |   1.1 MiB |  00m00s
[ 22/154] util-linux-0:2.40.1-2.fc41.x8 100% |  48.1 MiB/s |   1.2 MiB |  00m00s
[ 23/154] filesystem-0:3.18-9.fc41.x86_ 100% |  40.2 MiB/s |   1.1 MiB |  00m00s
[ 24/154] glibc-0:2.39.9000-26.fc41.x86 100% |  60.4 MiB/s |   2.2 MiB |  00m00s
[ 25/154] ncurses-libs-0:6.4-12.2024012 100% |  10.8 MiB/s | 332.5 KiB |  00m00s
[ 26/154] bzip2-libs-0:1.0.8-18.fc40.x8 100% |   1.7 MiB/s |  40.9 KiB |  00m00s
[ 27/154] coreutils-common-0:9.5-2.fc41 100% |  43.3 MiB/s |   2.1 MiB |  00m00s
[ 28/154] libacl-0:2.3.2-1.fc40.x86_64  100% | 479.0 KiB/s |  24.4 KiB |  00m00s
[ 29/154] libattr-0:2.5.2-3.fc40.x86_64 100% | 339.6 KiB/s |  18.0 KiB |  00m00s
[ 30/154] libcap-0:2.70-2.fc41.x86_64   100% |   7.7 MiB/s |  86.3 KiB |  00m00s
[ 31/154] libselinux-0:3.7-1.fc41.x86_6 100% |  10.7 MiB/s |  87.5 KiB |  00m00s
[ 32/154] openssl-libs-1:3.2.2-3.fc41.x 100% |  92.3 MiB/s |   2.3 MiB |  00m00s
[ 33/154] fedora-repos-0:41-0.2.noarch  100% | 388.7 KiB/s |   9.3 KiB |  00m00s
[ 34/154] glibc-common-0:2.39.9000-26.f 100% |  18.8 MiB/s | 405.0 KiB |  00m00s
[ 35/154] pcre2-0:10.44-1.fc41.x86_64   100% |  26.4 MiB/s | 243.0 KiB |  00m00s
[ 36/154] ed-0:1.20.2-1.fc41.x86_64     100% |   7.3 MiB/s |  81.9 KiB |  00m00s
[ 37/154] ansible-srpm-macros-0:1-15.fc 100% |   1.6 MiB/s |  20.9 KiB |  00m00s
[ 38/154] build-reproducibility-srpm-ma 100% |   1.1 MiB/s |  10.2 KiB |  00m00s
[ 39/154] dwz-0:0.15-6.fc40.x86_64      100% |  15.0 MiB/s | 137.8 KiB |  00m00s
[ 40/154] efi-srpm-macros-0:5-11.fc40.n 100% |   3.6 MiB/s |  22.3 KiB |  00m00s
[ 41/154] file-0:5.45-6.fc41.x86_64     100% |   6.0 MiB/s |  49.1 KiB |  00m00s
[ 42/154] fonts-srpm-macros-1:2.0.5-16. 100% |   2.4 MiB/s |  26.9 KiB |  00m00s
[ 43/154] forge-srpm-macros-0:0.3.1-1.f 100% |   2.1 MiB/s |  19.4 KiB |  00m00s
[ 44/154] fpc-srpm-macros-0:1.3-12.fc40 100% | 979.1 KiB/s |   7.8 KiB |  00m00s
[ 45/154] ghc-srpm-macros-0:1.9.1-1.fc4 100% |   1.5 MiB/s |   9.0 KiB |  00m00s
[ 46/154] gnat-srpm-macros-0:6-5.fc40.n 100% |   1.4 MiB/s |   8.8 KiB |  00m00s
[ 47/154] go-srpm-macros-0:3.6.0-1.fc41 100% |   2.7 MiB/s |  27.9 KiB |  00m00s
[ 48/154] kernel-srpm-macros-0:1.0-23.f 100% |   1.2 MiB/s |   9.8 KiB |  00m00s
[ 49/154] lua-srpm-macros-0:1-13.fc40.n 100% |   1.4 MiB/s |   8.7 KiB |  00m00s
[ 50/154] ocaml-srpm-macros-0:10-2.fc41 100% |   1.3 MiB/s |   9.1 KiB |  00m00s
[ 51/154] openblas-srpm-macros-0:2-17.f 100% | 957.5 KiB/s |   7.7 KiB |  00m00s
[ 52/154] package-notes-srpm-macros-0:0 100% |   1.4 MiB/s |   9.9 KiB |  00m00s
[ 53/154] perl-srpm-macros-0:1-55.fc41. 100% |   1.4 MiB/s |   8.4 KiB |  00m00s
[ 54/154] pyproject-srpm-macros-0:1.12. 100% |   1.8 MiB/s |  12.7 KiB |  00m00s
[ 55/154] python-srpm-macros-0:3.13-2.f 100% |   2.3 MiB/s |  23.8 KiB |  00m00s
[ 56/154] qt5-srpm-macros-0:5.15.14-1.f 100% |   1.1 MiB/s |   8.9 KiB |  00m00s
[ 57/154] qt6-srpm-macros-0:6.7.1-1.fc4 100% |   1.2 MiB/s |   8.9 KiB |  00m00s
[ 58/154] rpm-0:4.19.92-1.fc41.x86_64   100% |  48.9 MiB/s | 550.3 KiB |  00m00s
[ 59/154] rust-srpm-macros-0:26.3-1.fc4 100% | 961.8 KiB/s |  12.5 KiB |  00m00s
[ 60/154] zig-srpm-macros-0:1-2.fc40.no 100% | 618.4 KiB/s |   8.0 KiB |  00m00s
[ 61/154] zip-0:3.0-40.fc40.x86_64      100% |  28.7 MiB/s | 264.8 KiB |  00m00s
[ 62/154] debugedit-0:5.0-16.fc41.x86_6 100% |   9.7 MiB/s |  79.7 KiB |  00m00s
[ 63/154] elfutils-0:0.191-7.fc41.x86_6 100% |  39.8 MiB/s | 530.0 KiB |  00m00s
[ 64/154] elfutils-libelf-0:0.191-7.fc4 100% |  18.5 MiB/s | 208.5 KiB |  00m00s
[ 65/154] libarchive-0:3.7.4-1.fc41.x86 100% |  28.4 MiB/s | 407.6 KiB |  00m00s
[ 66/154] popt-0:1.19-6.fc40.x86_64     100% |   5.4 MiB/s |  66.7 KiB |  00m00s
[ 67/154] readline-0:8.2-8.fc40.x86_64  100% |  18.9 MiB/s | 213.3 KiB |  00m00s
[ 68/154] rpm-build-libs-0:4.19.92-1.fc 100% |  12.1 MiB/s |  99.2 KiB |  00m00s
[ 69/154] rpm-libs-0:4.19.92-1.fc41.x86 100% |  33.6 MiB/s | 309.6 KiB |  00m00s
[ 70/154] zstd-0:1.5.6-1.fc41.x86_64    100% |  39.0 MiB/s | 479.3 KiB |  00m00s
[ 71/154] audit-libs-0:4.0.1-3.fc41.x86 100% |   9.4 MiB/s | 125.3 KiB |  00m00s
[ 72/154] libeconf-0:0.6.2-2.fc41.x86_6 100% |   2.4 MiB/s |  32.0 KiB |  00m00s
[ 73/154] libsemanage-0:3.7-1.fc41.x86_ 100% |  12.6 MiB/s | 116.2 KiB |  00m00s
[ 74/154] libxcrypt-0:4.4.36-5.fc40.x86 100% |  11.5 MiB/s | 118.1 KiB |  00m00s
[ 75/154] pam-libs-0:1.6.1-3.fc41.x86_6 100% |   7.0 MiB/s |  57.1 KiB |  00m00s
[ 76/154] setup-0:2.15.0-4.fc41.noarch  100% |  18.9 MiB/s | 154.6 KiB |  00m00s
[ 77/154] xz-libs-1:5.6.2-1.fc41.x86_64 100% |  13.6 MiB/s | 111.6 KiB |  00m00s
[ 78/154] mpfr-0:4.2.1-4.fc41.x86_64    100% |  33.7 MiB/s | 345.2 KiB |  00m00s
[ 79/154] libblkid-0:2.40.1-2.fc41.x86_ 100% |  11.0 MiB/s | 124.2 KiB |  00m00s
[ 80/154] libcap-ng-0:0.8.5-2.fc41.x86_ 100% |   2.6 MiB/s |  32.5 KiB |  00m00s
[ 81/154] libfdisk-0:2.40.1-2.fc41.x86_ 100% |  15.6 MiB/s | 159.3 KiB |  00m00s
[ 82/154] libmount-0:2.40.1-2.fc41.x86_ 100% |  16.8 MiB/s | 154.8 KiB |  00m00s
[ 83/154] libsmartcols-0:2.40.1-2.fc41. 100% |  11.6 MiB/s |  83.4 KiB |  00m00s
[ 84/154] libutempter-0:1.2.1-13.fc40.x 100% |   3.2 MiB/s |  26.4 KiB |  00m00s
[ 85/154] libuuid-0:2.40.1-2.fc41.x86_6 100% |   3.1 MiB/s |  28.5 KiB |  00m00s
[ 86/154] systemd-libs-0:256.1-3.fc41.x 100% |  59.3 MiB/s | 729.0 KiB |  00m00s
[ 87/154] util-linux-core-0:2.40.1-2.fc 100% |  34.9 MiB/s | 536.8 KiB |  00m00s
[ 88/154] zlib-ng-compat-0:2.1.7-1.fc41 100% |   5.8 MiB/s |  77.7 KiB |  00m00s
[ 89/154] glibc-gconv-extra-0:2.39.9000 100% |  88.5 MiB/s |   1.7 MiB |  00m00s
[ 90/154] basesystem-0:11-20.fc40.noarc 100% | 479.2 KiB/s |   7.2 KiB |  00m00s
[ 91/154] libgcc-0:14.1.1-6.fc41.x86_64 100% |   8.5 MiB/s | 130.0 KiB |  00m00s
[ 92/154] ncurses-base-0:6.4-12.2024012 100% |  12.4 MiB/s |  88.9 KiB |  00m00s
[ 93/154] libsepol-0:3.7-1.fc41.x86_64  100% |  33.4 MiB/s | 342.0 KiB |  00m00s
[ 94/154] ca-certificates-0:2024.2.68_v 100% |  57.2 MiB/s | 879.1 KiB |  00m00s
[ 95/154] crypto-policies-0:20240628-1. 100% |   6.8 MiB/s |  90.8 KiB |  00m00s
[ 96/154] fedora-gpg-keys-0:41-0.2.noar 100% |  11.7 MiB/s | 131.8 KiB |  00m00s
[ 97/154] fedora-repos-rawhide-0:41-0.2 100% |   1.4 MiB/s |   8.9 KiB |  00m00s
[ 98/154] pcre2-syntax-0:10.44-1.fc41.n 100% |  18.3 MiB/s | 149.8 KiB |  00m00s
[ 99/154] add-determinism-0:0.3.3-1.fc4 100% |  69.2 MiB/s | 850.8 KiB |  00m00s
[100/154] file-libs-0:5.45-6.fc41.x86_6 100% |  43.8 MiB/s | 761.7 KiB |  00m00s
[101/154] curl-0:8.8.0-1.fc41.x86_64    100% |  16.4 MiB/s | 301.5 KiB |  00m00s
[102/154] elfutils-libs-0:0.191-7.fc41. 100% |  19.4 MiB/s | 258.1 KiB |  00m00s
[103/154] elfutils-debuginfod-client-0: 100% |   3.1 MiB/s |  38.2 KiB |  00m00s
[104/154] libstdc++-0:14.1.1-6.fc41.x86 100% |  61.8 MiB/s | 886.6 KiB |  00m00s
[105/154] libzstd-0:1.5.6-1.fc41.x86_64 100% |  18.9 MiB/s | 308.9 KiB |  00m00s
[106/154] libxml2-0:2.12.8-1.fc41.x86_6 100% |  41.9 MiB/s | 687.3 KiB |  00m00s
[107/154] lz4-libs-0:1.9.4-6.fc40.x86_6 100% |   5.5 MiB/s |  67.2 KiB |  00m00s
[108/154] libgomp-0:14.1.1-6.fc41.x86_6 100% |  31.1 MiB/s | 350.5 KiB |  00m00s
[109/154] lua-libs-0:5.4.6-5.fc40.x86_6 100% |  14.3 MiB/s | 131.9 KiB |  00m00s
[110/154] rpm-sequoia-0:1.6.0-3.fc41.x8 100% |  59.0 MiB/s | 846.1 KiB |  00m00s
[111/154] sqlite-libs-0:3.46.0-2.fc41.x 100% |  40.9 MiB/s | 712.5 KiB |  00m00s
[112/154] elfutils-default-yama-scope-0 100% | 953.5 KiB/s |  13.3 KiB |  00m00s
[113/154] authselect-libs-0:1.5.0-5.fc4 100% |  21.3 MiB/s | 218.6 KiB |  00m00s
[114/154] pam-0:1.6.1-3.fc41.x86_64     100% |  45.1 MiB/s | 553.6 KiB |  00m00s
[115/154] authselect-0:1.5.0-5.fc41.x86 100% |   9.5 MiB/s | 146.2 KiB |  00m00s
[116/154] gdbm-libs-1:1.23-6.fc40.x86_6 100% |   2.7 MiB/s |  56.2 KiB |  00m00s
[117/154] libnsl2-0:2.0.1-1.fc40.x86_64 100% |   2.6 MiB/s |  29.6 KiB |  00m00s
[118/154] libpwquality-0:1.4.5-10.fc41. 100% |  11.6 MiB/s | 119.0 KiB |  00m00s
[119/154] libtirpc-0:1.3.4-1.rc3.fc41.x 100% |  11.3 MiB/s |  92.5 KiB |  00m00s
[120/154] cracklib-0:2.9.11-5.fc40.x86_ 100% |  10.0 MiB/s |  92.5 KiB |  00m00s
[121/154] krb5-libs-0:1.21.2-5.fc40.x86 100% |  56.8 MiB/s | 756.1 KiB |  00m00s
[122/154] libcom_err-0:1.47.1-1.fc41.x8 100% |   2.0 MiB/s |  26.2 KiB |  00m00s
[123/154] keyutils-libs-0:1.6.3-3.fc40. 100% |   2.4 MiB/s |  31.5 KiB |  00m00s
[124/154] libverto-0:0.3.2-8.fc40.x86_6 100% |   1.5 MiB/s |  20.5 KiB |  00m00s
[125/154] alternatives-0:1.28-1.fc41.x8 100% |   2.5 MiB/s |  40.8 KiB |  00m00s
[126/154] jansson-0:2.13.1-9.fc40.x86_6 100% |   2.2 MiB/s |  44.2 KiB |  00m00s
[127/154] binutils-0:2.42.50-14.fc41.x8 100% | 126.4 MiB/s |   6.3 MiB |  00m00s
[128/154] pkgconf-pkg-config-0:2.1.1-1. 100% | 282.3 KiB/s |   9.9 KiB |  00m00s
[129/154] pkgconf-0:2.1.1-1.fc41.x86_64 100% |   1.4 MiB/s |  43.9 KiB |  00m00s
[130/154] pkgconf-m4-0:2.1.1-1.fc41.noa 100% |   1.7 MiB/s |  14.1 KiB |  00m00s
[131/154] libpkgconf-0:2.1.1-1.fc41.x86 100% |   3.4 MiB/s |  38.0 KiB |  00m00s
[132/154] gdbm-1:1.23-6.fc40.x86_64     100% |  12.4 MiB/s | 152.5 KiB |  00m00s
[133/154] p11-kit-0:0.25.3-4.fc40.x86_6 100% |  31.9 MiB/s | 489.8 KiB |  00m00s
[134/154] libffi-0:3.4.6-1.fc41.x86_64  100% |   2.3 MiB/s |  40.0 KiB |  00m00s
[135/154] libtasn1-0:4.19.0-6.fc40.x86_ 100% |   6.0 MiB/s |  73.7 KiB |  00m00s
[136/154] p11-kit-trust-0:0.25.3-4.fc40 100% |  12.8 MiB/s | 131.5 KiB |  00m00s
[137/154] fedora-release-0:41-0.14.noar 100% |   1.4 MiB/s |  11.5 KiB |  00m00s
[138/154] gdb-minimal-0:14.2-13.fc41.x8 100% | 122.7 MiB/s |   4.3 MiB |  00m00s
[139/154] xxhash-libs-0:0.8.2-2.fc40.x8 100% |   1.1 MiB/s |  36.9 KiB |  00m00s
[140/154] gmp-1:6.3.0-1.fc41.x86_64     100% |   8.6 MiB/s | 316.8 KiB |  00m00s
[141/154] fedora-release-identity-basic 100% |   2.0 MiB/s |  12.3 KiB |  00m00s
[142/154] libcurl-0:8.8.0-1.fc41.x86_64 100% |  38.6 MiB/s | 355.3 KiB |  00m00s
[143/154] libbrotli-0:1.1.0-4.fc41.x86_ 100% |  33.0 MiB/s | 337.9 KiB |  00m00s
[144/154] libidn2-0:2.3.7-1.fc40.x86_64 100% |  10.5 MiB/s | 118.7 KiB |  00m00s
[145/154] libnghttp2-0:1.62.1-1.fc41.x8 100% |   9.4 MiB/s |  76.7 KiB |  00m00s
[146/154] libpsl-0:0.21.5-3.fc40.x86_64 100% |   8.9 MiB/s |  63.9 KiB |  00m00s
[147/154] libssh-0:0.10.6-6.fc41.x86_64 100% |  25.8 MiB/s | 211.5 KiB |  00m00s
[148/154] openldap-0:2.6.8-3.fc41.x86_6 100% |  27.7 MiB/s | 255.5 KiB |  00m00s
[149/154] libunistring-0:1.1-7.fc41.x86 100% |  41.0 MiB/s | 545.4 KiB |  00m00s
[150/154] publicsuffix-list-dafsa-0:202 100% |   4.7 MiB/s |  58.1 KiB |  00m00s
[151/154] libssh-config-0:0.10.6-6.fc41 100% | 913.7 KiB/s |   9.1 KiB |  00m00s
[152/154] cyrus-sasl-lib-0:2.1.28-24.fc 100% |  59.7 MiB/s | 794.6 KiB |  00m00s
[153/154] libevent-0:2.1.12-13.fc41.x86 100% |  19.3 MiB/s | 257.2 KiB |  00m00s
[154/154] libtool-ltdl-0:2.4.7-11.fc41. 100% |   2.3 MiB/s |  35.4 KiB |  00m00s
--------------------------------------------------------------------------------
[154/154] Total                         100% |  63.6 MiB/s |  52.9 MiB |  00m01s
Running transaction
Importing PGP key 0xE99D6AD1:
 Userid     : "Fedora (41) <fedora-41-primary@fedoraproject.org>"
 Fingerprint: 466CF2D8B60BC3057AA9453ED0622462E99D6AD1
 From       : file:///usr/share/distribution-gpg-keys/fedora/RPM-GPG-KEY-fedora-41-primary
The key was successfully imported.
Importing PGP key 0xE99D6AD1:
 Userid     : "Fedora (41) <fedora-41-primary@fedoraproject.org>"
 Fingerprint: 466CF2D8B60BC3057AA9453ED0622462E99D6AD1
 From       : file:///usr/share/distribution-gpg-keys/fedora/RPM-GPG-KEY-fedora-41-primary
The key was successfully imported.
Importing PGP key 0xA15B79CC:
 Userid     : "Fedora (40) <fedora-40-primary@fedoraproject.org>"
 Fingerprint: 115DF9AEF857853EE8445D0A0727707EA15B79CC
 From       : file:///usr/share/distribution-gpg-keys/fedora/RPM-GPG-KEY-fedora-40-primary
The key was successfully imported.
[  1/156] Verify package files          100% | 678.0   B/s | 154.0   B |  00m00s
>>> Running pre-transaction scriptlet: filesystem-0:3.18-9.fc41.x86_64
>>> Stop pre-transaction scriptlet: filesystem-0:3.18-9.fc41.x86_64
[  2/156] Prepare transaction           100% |   4.2 KiB/s | 154.0   B |  00m00s
[  3/156] Installing libgcc-0:14.1.1-6. 100% |  38.5 MiB/s | 276.3 KiB |  00m00s
>>> Running post-install scriptlet: libgcc-0:14.1.1-6.fc41.x86_64
>>> Stop post-install scriptlet: libgcc-0:14.1.1-6.fc41.x86_64
[  4/156] Installing crypto-policies-0: 100% |  14.7 MiB/s | 150.4 KiB |  00m00s
>>> Running post-install scriptlet: crypto-policies-0:20240628-1.gitddd11d3.fc41
>>> Stop post-install scriptlet: crypto-policies-0:20240628-1.gitddd11d3.fc41.no
[  5/156] Installing libssh-config-0:0. 100% | 265.6 KiB/s | 816.0   B |  00m00s
[  6/156] Installing publicsuffix-list- 100% |  16.7 MiB/s |  68.3 KiB |  00m00s
[  7/156] Installing fedora-release-ide 100% | 309.9 KiB/s | 952.0   B |  00m00s
[  8/156] Installing fedora-repos-rawhi 100% | 806.0 KiB/s |   2.4 KiB |  00m00s
[  9/156] Installing fedora-gpg-keys-0: 100% |  13.8 MiB/s | 169.7 KiB |  00m00s
[ 10/156] Installing fedora-repos-0:41- 100% |   1.4 MiB/s |   5.7 KiB |  00m00s
[ 11/156] Installing fedora-release-com 100% |   5.7 MiB/s |  23.5 KiB |  00m00s
[ 12/156] Installing fedora-release-0:4 100% |  60.5 KiB/s | 124.0   B |  00m00s
[ 13/156] Installing setup-0:2.15.0-4.f 100% |  41.7 MiB/s | 726.1 KiB |  00m00s
>>> Running post-install scriptlet: setup-0:2.15.0-4.fc41.noarch
>>> Stop post-install scriptlet: setup-0:2.15.0-4.fc41.noarch
[ 14/156] Installing filesystem-0:3.18- 100% |   2.3 MiB/s | 212.5 KiB |  00m00s
[ 15/156] Installing basesystem-0:11-20 100% |  60.5 KiB/s | 124.0   B |  00m00s
[ 16/156] Installing pkgconf-m4-0:2.1.1 100% |   4.7 MiB/s |  14.3 KiB |  00m00s
[ 17/156] Installing pcre2-syntax-0:10. 100% |  62.0 MiB/s | 254.1 KiB |  00m00s
[ 18/156] Installing ncurses-base-0:6.4 100% |  31.2 MiB/s | 351.6 KiB |  00m00s
[ 19/156] Installing glibc-minimal-lang 100% |  24.2 KiB/s | 124.0   B |  00m00s
[ 20/156] Installing ncurses-libs-0:6.4 100% | 135.3 MiB/s | 969.7 KiB |  00m00s
>>> Running pre-install scriptlet: glibc-0:2.39.9000-26.fc41.x86_64
>>> Stop pre-install scriptlet: glibc-0:2.39.9000-26.fc41.x86_64
warning: posix.fork(): .fork(), .exec(), .wait() and .redirect2null() are deprecated, use rpm.execute() instead
warning: posix.wait(): .fork(), .exec(), .wait() and .redirect2null() are deprecated, use rpm.execute() instead
warning: posix.exec(): .fork(), .exec(), .wait() and .redirect2null() are deprecated, use rpm.execute() instead
warning: posix.fork(): .fork(), .exec(), .wait() and .redirect2null() are deprecated, use rpm.execute() instead
warning: posix.wait(): .fork(), .exec(), .wait() and .redirect2null() are deprecated, use rpm.execute() instead
warning: posix.exec(): .fork(), .exec(), .wait() and .redirect2null() are deprecated, use rpm.execute() instead
[ 21/156] Installing glibc-0:2.39.9000- 100% | 175.8 MiB/s |   6.7 MiB |  00m00s
>>> Running post-install scriptlet: glibc-0:2.39.9000-26.fc41.x86_64
>>> Stop post-install scriptlet: glibc-0:2.39.9000-26.fc41.x86_64
[ 22/156] Installing bash-0:5.2.26-3.fc 100% | 281.4 MiB/s |   8.2 MiB |  00m00s
>>> Running post-install scriptlet: bash-0:5.2.26-3.fc40.x86_64
>>> Stop post-install scriptlet: bash-0:5.2.26-3.fc40.x86_64
[ 23/156] Installing glibc-common-0:2.3 100% |  69.0 MiB/s |   1.0 MiB |  00m00s
warning: posix.fork(): .fork(), .exec(), .wait() and .redirect2null() are deprecated, use rpm.execute() instead
warning: posix.wait(): .fork(), .exec(), .wait() and .redirect2null() are deprecated, use rpm.execute() instead
warning: posix.exec(): .fork(), .exec(), .wait() and .redirect2null() are deprecated, use rpm.execute() instead
[ 24/156] Installing glibc-gconv-extra- 100% | 163.9 MiB/s |   7.9 MiB |  00m00s
>>> Running post-install scriptlet: glibc-gconv-extra-0:2.39.9000-26.fc41.x86_64
>>> Stop post-install scriptlet: glibc-gconv-extra-0:2.39.9000-26.fc41.x86_64
[ 25/156] Installing zlib-ng-compat-0:2 100% |  32.9 MiB/s | 134.8 KiB |  00m00s
[ 26/156] Installing bzip2-libs-0:1.0.8 100% |  20.0 MiB/s |  81.8 KiB |  00m00s
[ 27/156] Installing xz-libs-1:5.6.2-1. 100% |  52.6 MiB/s | 215.5 KiB |  00m00s
[ 28/156] Installing popt-0:1.19-6.fc40 100% |  23.4 MiB/s | 143.5 KiB |  00m00s
[ 29/156] Installing readline-0:8.2-8.f 100% |  80.0 MiB/s | 491.4 KiB |  00m00s
[ 30/156] Installing libuuid-0:2.40.1-2 100% |  12.5 MiB/s |  38.4 KiB |  00m00s
[ 31/156] Installing libblkid-0:2.40.1- 100% |  63.4 MiB/s | 259.5 KiB |  00m00s
[ 32/156] Installing libattr-0:2.5.2-3. 100% |   9.6 MiB/s |  29.5 KiB |  00m00s
[ 33/156] Installing libacl-0:2.3.2-1.f 100% |   8.0 MiB/s |  40.8 KiB |  00m00s
[ 34/156] Installing libxcrypt-0:4.4.36 100% |  43.2 MiB/s | 265.5 KiB |  00m00s
[ 35/156] Installing libstdc++-0:14.1.1 100% | 197.2 MiB/s |   3.0 MiB |  00m00s
[ 36/156] Installing libzstd-0:1.5.6-1. 100% | 154.1 MiB/s | 789.2 KiB |  00m00s
[ 37/156] Installing elfutils-libelf-0: 100% | 194.9 MiB/s |   1.2 MiB |  00m00s
[ 38/156] Installing gmp-1:6.3.0-1.fc41 100% | 131.1 MiB/s | 805.6 KiB |  00m00s
[ 39/156] Installing libeconf-0:0.6.2-2 100% |  19.4 MiB/s |  59.7 KiB |  00m00s
[ 40/156] Installing gdbm-libs-1:1.23-6 100% |  40.2 MiB/s | 123.6 KiB |  00m00s
[ 41/156] Installing mpfr-0:4.2.1-4.fc4 100% | 115.7 MiB/s | 829.7 KiB |  00m00s
[ 42/156] Installing gawk-0:5.3.0-3.fc4 100% | 157.1 MiB/s |   1.7 MiB |  00m00s
[ 43/156] Installing dwz-0:0.15-6.fc40. 100% |  71.4 MiB/s | 292.3 KiB |  00m00s
[ 44/156] Installing unzip-0:6.0-63.fc4 100% |  62.9 MiB/s | 386.3 KiB |  00m00s
[ 45/156] Installing file-libs-0:5.45-6 100% | 522.6 MiB/s |   9.9 MiB |  00m00s
[ 46/156] Installing file-0:5.45-6.fc41 100% |  34.2 MiB/s | 105.0 KiB |  00m00s
[ 47/156] Installing pcre2-0:10.44-1.fc 100% | 127.9 MiB/s | 654.9 KiB |  00m00s
[ 48/156] Installing grep-0:3.11-8.fc41 100% | 111.0 MiB/s |   1.0 MiB |  00m00s
[ 49/156] Installing xz-1:5.6.2-1.fc41. 100% |  92.7 MiB/s |   1.2 MiB |  00m00s
[ 50/156] Installing libcap-ng-0:0.8.5- 100% |  23.1 MiB/s |  71.0 KiB |  00m00s
[ 51/156] Installing audit-libs-0:4.0.1 100% |  53.6 MiB/s | 329.4 KiB |  00m00s
[ 52/156] Installing pam-libs-0:1.6.1-3 100% |  33.5 MiB/s | 137.4 KiB |  00m00s
[ 53/156] Installing libcap-0:2.70-2.fc 100% |  36.7 MiB/s | 225.2 KiB |  00m00s
[ 54/156] Installing systemd-libs-0:256 100% | 169.1 MiB/s |   2.0 MiB |  00m00s
[ 55/156] Installing libsmartcols-0:2.4 100% |  59.1 MiB/s | 181.5 KiB |  00m00s
[ 56/156] Installing libsepol-0:3.7-1.f 100% | 133.3 MiB/s | 818.8 KiB |  00m00s
[ 57/156] Installing libselinux-0:3.7-1 100% |  59.3 MiB/s | 182.3 KiB |  00m00s
[ 58/156] Installing sed-0:4.9-1.fc40.x 100% | 106.2 MiB/s | 869.7 KiB |  00m00s
[ 59/156] Installing findutils-1:4.10.0 100% | 168.9 MiB/s |   1.9 MiB |  00m00s
[ 60/156] Installing libmount-0:2.40.1- 100% | 114.9 MiB/s | 352.9 KiB |  00m00s
[ 61/156] Installing lz4-libs-0:1.9.4-6 100% |  31.9 MiB/s | 130.5 KiB |  00m00s
[ 62/156] Installing lua-libs-0:5.4.6-5 100% |  91.9 MiB/s | 282.3 KiB |  00m00s
[ 63/156] Installing libcom_err-0:1.47. 100% |  33.4 MiB/s |  68.3 KiB |  00m00s
[ 64/156] Installing alternatives-0:1.2 100% |  16.6 MiB/s |  68.0 KiB |  00m00s
[ 65/156] Installing libtasn1-0:4.19.0- 100% |  57.8 MiB/s | 177.5 KiB |  00m00s
[ 66/156] Installing libunistring-0:1.1 100% | 247.2 MiB/s |   1.7 MiB |  00m00s
[ 67/156] Installing libidn2-0:2.3.7-1. 100% |  46.7 MiB/s | 335.0 KiB |  00m00s
[ 68/156] Installing libpsl-0:0.21.5-3. 100% |  26.6 MiB/s |  81.6 KiB |  00m00s
[ 69/156] Installing zstd-0:1.5.6-1.fc4 100% | 209.5 MiB/s |   1.7 MiB |  00m00s
[ 70/156] Installing util-linux-core-0: 100% | 106.1 MiB/s |   1.5 MiB |  00m00s
[ 71/156] Installing tar-2:1.35-3.fc40. 100% | 210.8 MiB/s |   3.0 MiB |  00m00s
[ 72/156] Installing libsemanage-0:3.7- 100% |  57.7 MiB/s | 295.2 KiB |  00m00s
[ 73/156] Installing shadow-utils-2:4.1 100% |  88.7 MiB/s |   4.2 MiB |  00m00s
>>> Running pre-install scriptlet: libutempter-0:1.2.1-13.fc40.x86_64
>>> Stop pre-install scriptlet: libutempter-0:1.2.1-13.fc40.x86_64
[ 74/156] Installing libutempter-0:1.2. 100% |  11.7 MiB/s |  59.7 KiB |  00m00s
[ 75/156] Installing zip-0:3.0-40.fc40. 100% |  98.6 MiB/s | 707.1 KiB |  00m00s
[ 76/156] Installing gdbm-1:1.23-6.fc40 100% |  56.9 MiB/s | 465.8 KiB |  00m00s
[ 77/156] Installing cyrus-sasl-lib-0:2 100% | 192.2 MiB/s |   2.3 MiB |  00m00s
[ 78/156] Installing libfdisk-0:2.40.1- 100% |  88.8 MiB/s | 363.9 KiB |  00m00s
[ 79/156] Installing libxml2-0:2.12.8-1 100% | 155.6 MiB/s |   1.7 MiB |  00m00s
[ 80/156] Installing bzip2-0:1.0.8-18.f 100% |  23.5 MiB/s |  96.2 KiB |  00m00s
[ 81/156] Installing add-determinism-0: 100% | 225.8 MiB/s |   2.3 MiB |  00m00s
[ 82/156] Installing build-reproducibil 100% | 333.3 KiB/s |   1.0 KiB |  00m00s
[ 83/156] Installing sqlite-libs-0:3.46 100% | 204.2 MiB/s |   1.4 MiB |  00m00s
[ 84/156] Installing ed-0:1.20.2-1.fc41 100% |  29.1 MiB/s | 149.2 KiB |  00m00s
[ 85/156] Installing patch-0:2.7.6-24.f 100% |  64.5 MiB/s | 264.3 KiB |  00m00s
[ 86/156] Installing elfutils-default-y 100% | 340.5 KiB/s |   2.0 KiB |  00m00s
>>> Running post-install scriptlet: elfutils-default-yama-scope-0:0.191-7.fc41.n
>>> Stop post-install scriptlet: elfutils-default-yama-scope-0:0.191-7.fc41.noar
[ 87/156] Installing elfutils-libs-0:0. 100% |  90.4 MiB/s | 648.0 KiB |  00m00s
[ 88/156] Installing cpio-0:2.15-1.fc40 100% | 122.2 MiB/s |   1.1 MiB |  00m00s
[ 89/156] Installing diffutils-0:3.10-5 100% | 132.2 MiB/s |   1.6 MiB |  00m00s
[ 90/156] Installing libgomp-0:14.1.1-6 100% | 102.5 MiB/s | 524.7 KiB |  00m00s
[ 91/156] Installing keyutils-libs-0:1. 100% |  13.6 MiB/s |  55.8 KiB |  00m00s
[ 92/156] Installing libverto-0:0.3.2-8 100% |  10.2 MiB/s |  31.3 KiB |  00m00s
[ 93/156] Installing jansson-0:2.13.1-9 100% |  29.2 MiB/s |  89.7 KiB |  00m00s
[ 94/156] Installing libpkgconf-0:2.1.1 100% |  14.7 MiB/s |  75.3 KiB |  00m00s
[ 95/156] Installing pkgconf-0:2.1.1-1. 100% |  20.8 MiB/s |  85.4 KiB |  00m00s
[ 96/156] Installing pkgconf-pkg-config 100% | 591.1 KiB/s |   1.8 KiB |  00m00s
[ 97/156] Installing libffi-0:3.4.6-1.f 100% |  20.5 MiB/s |  83.8 KiB |  00m00s
[ 98/156] Installing p11-kit-0:0.25.3-4 100% | 156.7 MiB/s |   2.2 MiB |  00m00s
[ 99/156] Installing p11-kit-trust-0:0. 100% |  42.7 MiB/s | 393.1 KiB |  00m00s
>>> Running post-install scriptlet: p11-kit-trust-0:0.25.3-4.fc40.x86_64
>>> Stop post-install scriptlet: p11-kit-trust-0:0.25.3-4.fc40.x86_64
[100/156] Installing xxhash-libs-0:0.8. 100% |  29.3 MiB/s |  89.9 KiB |  00m00s
[101/156] Installing libbrotli-0:1.1.0- 100% | 135.4 MiB/s | 831.8 KiB |  00m00s
[102/156] Installing libnghttp2-0:1.62. 100% |  54.4 MiB/s | 167.2 KiB |  00m00s
[103/156] Installing libtool-ltdl-0:2.4 100% |  21.9 MiB/s |  67.3 KiB |  00m00s
[104/156] Installing rust-srpm-macros-0 100% |   1.4 MiB/s |   5.6 KiB |  00m00s
[105/156] Installing qt6-srpm-macros-0: 100% | 357.4 KiB/s | 732.0   B |  00m00s
[106/156] Installing qt5-srpm-macros-0: 100% | 378.9 KiB/s | 776.0   B |  00m00s
[107/156] Installing perl-srpm-macros-0 100% | 556.6 KiB/s |   1.1 KiB |  00m00s
[108/156] Installing package-notes-srpm 100% |   1.0 MiB/s |   2.0 KiB |  00m00s
[109/156] Installing openblas-srpm-macr 100% |  95.7 KiB/s | 392.0   B |  00m00s
[110/156] Installing ocaml-srpm-macros- 100% |   1.1 MiB/s |   2.2 KiB |  00m00s
[111/156] Installing kernel-srpm-macros 100% | 776.0 KiB/s |   2.3 KiB |  00m00s
[112/156] Installing gnat-srpm-macros-0 100% | 632.8 KiB/s |   1.3 KiB |  00m00s
[113/156] Installing ghc-srpm-macros-0: 100% | 500.0 KiB/s |   1.0 KiB |  00m00s
[114/156] Installing fpc-srpm-macros-0: 100% | 136.7 KiB/s | 420.0   B |  00m00s
[115/156] Installing ansible-srpm-macro 100% |  11.8 MiB/s |  36.2 KiB |  00m00s
[116/156] Installing coreutils-common-0 100% | 279.8 MiB/s |  11.2 MiB |  00m00s
[117/156] Installing openssl-libs-1:3.2 100% | 313.0 MiB/s |   7.8 MiB |  00m00s
[118/156] Installing coreutils-0:9.5-2. 100% | 180.4 MiB/s |   5.6 MiB |  00m00s
>>> Running pre-install scriptlet: ca-certificates-0:2024.2.68_v8.0.302-2.fc41.n
>>> Stop pre-install scriptlet: ca-certificates-0:2024.2.68_v8.0.302-2.fc41.noar
[119/156] Installing ca-certificates-0: 100% |   3.6 MiB/s |   2.4 MiB |  00m01s
>>> Running post-install scriptlet: ca-certificates-0:2024.2.68_v8.0.302-2.fc41.
>>> Stop post-install scriptlet: ca-certificates-0:2024.2.68_v8.0.302-2.fc41.noa
[120/156] Installing krb5-libs-0:1.21.2 100% | 153.0 MiB/s |   2.3 MiB |  00m00s
[121/156] Installing libarchive-0:3.7.4 100% | 111.9 MiB/s | 916.6 KiB |  00m00s
[122/156] Installing libtirpc-0:1.3.4-1 100% |  49.9 MiB/s | 204.6 KiB |  00m00s
[123/156] Installing gzip-0:1.13-1.fc40 100% |  47.7 MiB/s | 390.6 KiB |  00m00s
[124/156] Installing authselect-libs-0: 100% |  62.6 MiB/s | 833.2 KiB |  00m00s
[125/156] Installing authselect-0:1.5.0 100% |  22.0 MiB/s | 157.9 KiB |  00m00s
[126/156] Installing cracklib-0:2.9.11- 100% |  24.4 MiB/s | 250.3 KiB |  00m00s
[127/156] Installing libpwquality-0:1.4 100% |  38.2 MiB/s | 430.1 KiB |  00m00s
[128/156] Installing libnsl2-0:2.0.1-1. 100% |  14.4 MiB/s |  59.0 KiB |  00m00s
[129/156] Installing pam-0:1.6.1-3.fc41 100% |  75.8 MiB/s |   1.8 MiB |  00m00s
[130/156] Installing libssh-0:0.10.6-6. 100% |  83.9 MiB/s | 515.4 KiB |  00m00s
[131/156] Installing rpm-sequoia-0:1.6. 100% | 245.6 MiB/s |   2.2 MiB |  00m00s
[132/156] Installing rpm-libs-0:4.19.92 100% | 117.1 MiB/s | 719.5 KiB |  00m00s
[133/156] Installing rpm-build-libs-0:4 100% |  50.7 MiB/s | 207.5 KiB |  00m00s
[134/156] Installing libevent-0:2.1.12- 100% | 125.5 MiB/s | 899.4 KiB |  00m00s
[135/156] Installing openldap-0:2.6.8-3 100% |  78.6 MiB/s | 644.1 KiB |  00m00s
[136/156] Installing libcurl-0:8.8.0-1. 100% | 131.3 MiB/s | 806.8 KiB |  00m00s
[137/156] Installing elfutils-debuginfo 100% |  10.9 MiB/s |  66.9 KiB |  00m00s
[138/156] Installing elfutils-0:0.191-7 100% | 196.3 MiB/s |   2.6 MiB |  00m00s
[139/156] Installing binutils-0:2.42.50 100% | 322.7 MiB/s |  26.8 MiB |  00m00s
>>> Running post-install scriptlet: binutils-0:2.42.50-14.fc41.x86_64
>>> Stop post-install scriptlet: binutils-0:2.42.50-14.fc41.x86_64
[140/156] Installing gdb-minimal-0:14.2 100% | 344.5 MiB/s |  12.7 MiB |  00m00s
[141/156] Installing debugedit-0:5.0-16 100% |  32.9 MiB/s | 202.0 KiB |  00m00s
[142/156] Installing curl-0:8.8.0-1.fc4 100% |  66.2 MiB/s | 746.2 KiB |  00m00s
>>> Running pre-install scriptlet: rpm-0:4.19.92-1.fc41.x86_64
>>> Stop pre-install scriptlet: rpm-0:4.19.92-1.fc41.x86_64
[143/156] Installing rpm-0:4.19.92-1.fc 100% | 103.8 MiB/s |   2.5 MiB |  00m00s
[144/156] Installing efi-srpm-macros-0: 100% |  10.0 MiB/s |  41.2 KiB |  00m00s
[145/156] Installing lua-srpm-macros-0: 100% | 951.2 KiB/s |   1.9 KiB |  00m00s
[146/156] Installing zig-srpm-macros-0: 100% | 832.0 KiB/s |   1.7 KiB |  00m00s
[147/156] Installing fonts-srpm-macros- 100% |  18.6 MiB/s |  57.0 KiB |  00m00s
[148/156] Installing forge-srpm-macros- 100% |   9.9 MiB/s |  40.3 KiB |  00m00s
[149/156] Installing go-srpm-macros-0:3 100% |  20.2 MiB/s |  62.0 KiB |  00m00s
[150/156] Installing python-srpm-macros 100% |  17.0 MiB/s |  52.2 KiB |  00m00s
[151/156] Installing redhat-rpm-config- 100% |  30.9 MiB/s | 190.1 KiB |  00m00s
[152/156] Installing rpm-build-0:4.19.9 100% |  28.3 MiB/s | 202.6 KiB |  00m00s
[153/156] Installing pyproject-srpm-mac 100% | 518.6 KiB/s |   2.1 KiB |  00m00s
[154/156] Installing util-linux-0:2.40. 100% | 107.0 MiB/s |   3.7 MiB |  00m00s
>>> Running post-install scriptlet: util-linux-0:2.40.1-2.fc41.x86_64
>>> Stop post-install scriptlet: util-linux-0:2.40.1-2.fc41.x86_64
[155/156] Installing which-0:2.21-41.fc 100% |  13.4 MiB/s |  82.4 KiB |  00m00s
warning: posix.fork(): .fork(), .exec(), .wait() and .redirect2null() are deprecated, use rpm.execute() instead
warning: posix.wait(): .fork(), .exec(), .wait() and .redirect2null() are deprecated, use rpm.execute() instead
warning: posix.exec(): .fork(), .exec(), .wait() and .redirect2null() are deprecated, use rpm.execute() instead
[156/156] Installing info-0:7.1-2.fc40. 100% | 171.9 KiB/s | 358.2 KiB |  00m02s
>>> Running post-transaction scriptlet: filesystem-0:3.18-9.fc41.x86_64
>>> Stop post-transaction scriptlet: filesystem-0:3.18-9.fc41.x86_64
>>> Running post-transaction scriptlet: ca-certificates-0:2024.2.68_v8.0.302-2.f
>>> Stop post-transaction scriptlet: ca-certificates-0:2024.2.68_v8.0.302-2.fc41
>>> Running post-transaction scriptlet: authselect-libs-0:1.5.0-5.fc41.x86_64
>>> Stop post-transaction scriptlet: authselect-libs-0:1.5.0-5.fc41.x86_64
>>> Running post-transaction scriptlet: rpm-0:4.19.92-1.fc41.x86_64
>>> Stop post-transaction scriptlet: rpm-0:4.19.92-1.fc41.x86_64
>>> Running trigger-install scriptlet: glibc-common-0:2.39.9000-26.fc41.x86_64
>>> Stop trigger-install scriptlet: glibc-common-0:2.39.9000-26.fc41.x86_64
>>> Running trigger-install scriptlet: info-0:7.1-2.fc40.x86_64
>>> Stop trigger-install scriptlet: info-0:7.1-2.fc40.x86_64
Finish: installing minimal buildroot with dnf5
Start: creating root cache
Finish: creating root cache
Finish: chroot init
INFO: Installed packages:
INFO: add-determinism-0.3.3-1.fc41.x86_64
alternatives-1.28-1.fc41.x86_64
ansible-srpm-macros-1-15.fc41.noarch
audit-libs-4.0.1-3.fc41.x86_64
authselect-1.5.0-5.fc41.x86_64
authselect-libs-1.5.0-5.fc41.x86_64
basesystem-11-20.fc40.noarch
bash-5.2.26-3.fc40.x86_64
binutils-2.42.50-14.fc41.x86_64
build-reproducibility-srpm-macros-0.3.3-1.fc41.noarch
bzip2-1.0.8-18.fc40.x86_64
bzip2-libs-1.0.8-18.fc40.x86_64
ca-certificates-2024.2.68_v8.0.302-2.fc41.noarch
coreutils-9.5-2.fc41.x86_64
coreutils-common-9.5-2.fc41.x86_64
cpio-2.15-1.fc40.x86_64
cracklib-2.9.11-5.fc40.x86_64
crypto-policies-20240628-1.gitddd11d3.fc41.noarch
curl-8.8.0-1.fc41.x86_64
cyrus-sasl-lib-2.1.28-24.fc41.x86_64
debugedit-5.0-16.fc41.x86_64
diffutils-3.10-5.fc40.x86_64
dwz-0.15-6.fc40.x86_64
ed-1.20.2-1.fc41.x86_64
efi-srpm-macros-5-11.fc40.noarch
elfutils-0.191-7.fc41.x86_64
elfutils-debuginfod-client-0.191-7.fc41.x86_64
elfutils-default-yama-scope-0.191-7.fc41.noarch
elfutils-libelf-0.191-7.fc41.x86_64
elfutils-libs-0.191-7.fc41.x86_64
fedora-gpg-keys-41-0.2.noarch
fedora-release-41-0.14.noarch
fedora-release-common-41-0.14.noarch
fedora-release-identity-basic-41-0.14.noarch
fedora-repos-41-0.2.noarch
fedora-repos-rawhide-41-0.2.noarch
file-5.45-6.fc41.x86_64
file-libs-5.45-6.fc41.x86_64
filesystem-3.18-9.fc41.x86_64
findutils-4.10.0-2.fc41.x86_64
fonts-srpm-macros-2.0.5-16.fc41.noarch
forge-srpm-macros-0.3.1-1.fc41.noarch
fpc-srpm-macros-1.3-12.fc40.noarch
gawk-5.3.0-3.fc40.x86_64
gdb-minimal-14.2-13.fc41.x86_64
gdbm-1.23-6.fc40.x86_64
gdbm-libs-1.23-6.fc40.x86_64
ghc-srpm-macros-1.9.1-1.fc41.noarch
glibc-2.39.9000-26.fc41.x86_64
glibc-common-2.39.9000-26.fc41.x86_64
glibc-gconv-extra-2.39.9000-26.fc41.x86_64
glibc-minimal-langpack-2.39.9000-26.fc41.x86_64
gmp-6.3.0-1.fc41.x86_64
gnat-srpm-macros-6-5.fc40.noarch
go-srpm-macros-3.6.0-1.fc41.noarch
gpg-pubkey-a15b79cc-63d04c2c
gpg-pubkey-e99d6ad1-64d2612c
grep-3.11-8.fc41.x86_64
gzip-1.13-1.fc40.x86_64
info-7.1-2.fc40.x86_64
jansson-2.13.1-9.fc40.x86_64
kernel-srpm-macros-1.0-23.fc41.noarch
keyutils-libs-1.6.3-3.fc40.x86_64
krb5-libs-1.21.2-5.fc40.x86_64
libacl-2.3.2-1.fc40.x86_64
libarchive-3.7.4-1.fc41.x86_64
libattr-2.5.2-3.fc40.x86_64
libblkid-2.40.1-2.fc41.x86_64
libbrotli-1.1.0-4.fc41.x86_64
libcap-2.70-2.fc41.x86_64
libcap-ng-0.8.5-2.fc41.x86_64
libcom_err-1.47.1-1.fc41.x86_64
libcurl-8.8.0-1.fc41.x86_64
libeconf-0.6.2-2.fc41.x86_64
libevent-2.1.12-13.fc41.x86_64
libfdisk-2.40.1-2.fc41.x86_64
libffi-3.4.6-1.fc41.x86_64
libgcc-14.1.1-6.fc41.x86_64
libgomp-14.1.1-6.fc41.x86_64
libidn2-2.3.7-1.fc40.x86_64
libmount-2.40.1-2.fc41.x86_64
libnghttp2-1.62.1-1.fc41.x86_64
libnsl2-2.0.1-1.fc40.x86_64
libpkgconf-2.1.1-1.fc41.x86_64
libpsl-0.21.5-3.fc40.x86_64
libpwquality-1.4.5-10.fc41.x86_64
libselinux-3.7-1.fc41.x86_64
libsemanage-3.7-1.fc41.x86_64
libsepol-3.7-1.fc41.x86_64
libsmartcols-2.40.1-2.fc41.x86_64
libssh-0.10.6-6.fc41.x86_64
libssh-config-0.10.6-6.fc41.noarch
libstdc++-14.1.1-6.fc41.x86_64
libtasn1-4.19.0-6.fc40.x86_64
libtirpc-1.3.4-1.rc3.fc41.x86_64
libtool-ltdl-2.4.7-11.fc41.x86_64
libunistring-1.1-7.fc41.x86_64
libutempter-1.2.1-13.fc40.x86_64
libuuid-2.40.1-2.fc41.x86_64
libverto-0.3.2-8.fc40.x86_64
libxcrypt-4.4.36-5.fc40.x86_64
libxml2-2.12.8-1.fc41.x86_64
libzstd-1.5.6-1.fc41.x86_64
lua-libs-5.4.6-5.fc40.x86_64
lua-srpm-macros-1-13.fc40.noarch
lz4-libs-1.9.4-6.fc40.x86_64
mpfr-4.2.1-4.fc41.x86_64
ncurses-base-6.4-12.20240127.fc40.noarch
ncurses-libs-6.4-12.20240127.fc40.x86_64
ocaml-srpm-macros-10-2.fc41.noarch
openblas-srpm-macros-2-17.fc41.noarch
openldap-2.6.8-3.fc41.x86_64
openssl-libs-3.2.2-3.fc41.x86_64
p11-kit-0.25.3-4.fc40.x86_64
p11-kit-trust-0.25.3-4.fc40.x86_64
package-notes-srpm-macros-0.5-11.fc40.noarch
pam-1.6.1-3.fc41.x86_64
pam-libs-1.6.1-3.fc41.x86_64
patch-2.7.6-24.fc40.x86_64
pcre2-10.44-1.fc41.x86_64
pcre2-syntax-10.44-1.fc41.noarch
perl-srpm-macros-1-55.fc41.noarch
pkgconf-2.1.1-1.fc41.x86_64
pkgconf-m4-2.1.1-1.fc41.noarch
pkgconf-pkg-config-2.1.1-1.fc41.x86_64
popt-1.19-6.fc40.x86_64
publicsuffix-list-dafsa-20240107-3.fc40.noarch
pyproject-srpm-macros-1.12.2-1.fc41.noarch
python-srpm-macros-3.13-2.fc41.noarch
qt5-srpm-macros-5.15.14-1.fc41.noarch
qt6-srpm-macros-6.7.1-1.fc41.noarch
readline-8.2-8.fc40.x86_64
redhat-rpm-config-293-1.fc41.noarch
rpm-4.19.92-1.fc41.x86_64
rpm-build-4.19.92-1.fc41.x86_64
rpm-build-libs-4.19.92-1.fc41.x86_64
rpm-libs-4.19.92-1.fc41.x86_64
rpm-sequoia-1.6.0-3.fc41.x86_64
rust-srpm-macros-26.3-1.fc41.noarch
sed-4.9-1.fc40.x86_64
setup-2.15.0-4.fc41.noarch
shadow-utils-4.15.1-5.fc41.x86_64
sqlite-libs-3.46.0-2.fc41.x86_64
systemd-libs-256.1-3.fc41.x86_64
tar-1.35-3.fc40.x86_64
unzip-6.0-63.fc40.x86_64
util-linux-2.40.1-2.fc41.x86_64
util-linux-core-2.40.1-2.fc41.x86_64
which-2.21-41.fc40.x86_64
xxhash-libs-0.8.2-2.fc40.x86_64
xz-5.6.2-1.fc41.x86_64
xz-libs-5.6.2-1.fc41.x86_64
zig-srpm-macros-1-2.fc40.noarch
zip-3.0-40.fc40.x86_64
zlib-ng-compat-2.1.7-1.fc41.x86_64
zstd-1.5.6-1.fc41.x86_64
Finish: run

>>> 2024-07-03 16:13:09	"/usr/bin/mock" "-r" "fedora-41-x86_64" "--plugin-option=tmpfs:keep_mounted=True" "--config-opts=print_main_output=True" "--quiet" "--installdeps" "/tmp/csmock3_58cvwq/mod_wsgi-5.0.0-1.fc40.src.rpm"
Updating and loading repositories:
 fedora                                 100% |   1.2 MiB/s |  24.8 KiB |  00m00s
Repositories loaded.
Package                         Arch   Version                        Repository      Size
Installing:
 gcc                            x86_64 14.1.1-6.fc41                  fedora     104.1 MiB
 httpd-devel                    x86_64 2.4.59-2.fc41                  fedora     912.6 KiB
 make                           x86_64 1:4.4.1-6.fc40                 fedora       1.8 MiB
 python3-devel                  x86_64 3.13.0~b3-1.fc41               fedora       1.8 MiB
 python3-setuptools             noarch 69.2.0-6.fc41                  fedora       7.3 MiB
 python3-sphinx                 noarch 1:7.2.6-8.fc41                 fedora      10.9 MiB
 python3-sphinx_rtd_theme       noarch 2.0.0-4.fc41                   fedora     317.9 KiB
Installing dependencies:
 annobin-docs                   noarch 12.60-1.fc41                   fedora      96.2 KiB
 annobin-plugin-gcc             x86_64 12.60-1.fc41                   fedora     976.2 KiB
 apr                            x86_64 1.7.3-8.fc40                   fedora     293.3 KiB
 apr-devel                      x86_64 1.7.3-8.fc40                   fedora       1.0 MiB
 apr-util                       x86_64 1.6.3-17.fc41                  fedora     220.5 KiB
 apr-util-devel                 x86_64 1.6.3-17.fc41                  fedora     317.5 KiB
 apr-util-lmdb                  x86_64 1.6.3-17.fc41                  fedora      15.2 KiB
 autoconf                       noarch 2.72-2.fc41                    fedora       2.8 MiB
 automake                       noarch 1.16.5-16.fc40                 fedora       1.7 MiB
 cpp                            x86_64 14.1.1-6.fc41                  fedora      35.0 MiB
 cyrus-sasl                     x86_64 2.1.28-24.fc41                 fedora     145.2 KiB
 cyrus-sasl-devel               x86_64 2.1.28-24.fc41                 fedora     206.8 KiB
 emacs-filesystem               noarch 1:30.0-2.fc41                  fedora       0.0   B
 expat                          x86_64 2.6.2-1.fc41                   fedora     280.8 KiB
 expat-devel                    x86_64 2.6.2-1.fc41                   fedora     202.5 KiB
 fontawesome4-fonts             noarch 1:4.7.0-22.fc41                fedora     296.6 KiB
 fonts-filesystem               noarch 1:2.0.5-16.fc41                fedora       0.0   B
 gc                             x86_64 8.2.2-6.fc40                   fedora     258.7 KiB
 gcc-plugin-annobin             x86_64 14.1.1-6.fc41                  fedora      57.1 KiB
 glibc-devel                    x86_64 2.39.9000-26.fc41              fedora      36.8 KiB
 glibc-headers-x86              noarch 2.39.9000-26.fc41              fedora       2.2 MiB
 google-roboto-slab-fonts       noarch 1.100263-0.23.20150923git.fc40 fedora     699.6 KiB
 groff-base                     x86_64 1.23.0-6.fc40                  fedora       3.8 MiB
 guile30                        x86_64 3.0.9-1.fc41                   fedora      52.7 MiB
 httpd-core                     x86_64 2.4.59-2.fc41                  fedora       4.6 MiB
 httpd-filesystem               noarch 2.4.59-2.fc41                  fedora     464.0   B
 httpd-tools                    x86_64 2.4.59-2.fc41                  fedora     199.8 KiB
 kernel-headers                 x86_64 6.10.0-0.rc6.50.fc41           fedora       6.3 MiB
 lato-fonts                     noarch 2.015-20.fc40                  fedora      11.3 MiB
 libb2                          x86_64 0.98.1-11.fc40                 fedora      42.2 KiB
 libmpc                         x86_64 1.3.1-5.fc40                   fedora     164.7 KiB
 libtool                        x86_64 2.4.7-11.fc41                  fedora       2.6 MiB
 libxcrypt-devel                x86_64 4.4.36-5.fc40                  fedora      30.3 KiB
 lmdb                           x86_64 0.9.33-1.fc41                  fedora      74.7 KiB
 lmdb-devel                     x86_64 0.9.33-1.fc41                  fedora      72.5 KiB
 lmdb-libs                      x86_64 0.9.33-1.fc41                  fedora     109.6 KiB
 m4                             x86_64 1.4.19-9.fc40                  fedora     588.9 KiB
 mailcap                        noarch 2.1.54-5.fc40                  fedora      86.0 KiB
 mpdecimal                      x86_64 2.5.1-9.fc40                   fedora     200.9 KiB
 ncurses                        x86_64 6.4-12.20240127.fc40           fedora     621.0 KiB
 openldap-devel                 x86_64 2.6.8-3.fc41                   fedora       3.7 MiB
 perl-AutoLoader                noarch 5.74-509.fc41                  fedora      20.5 KiB
 perl-B                         x86_64 1.89-509.fc41                  fedora     494.0 KiB
 perl-Carp                      noarch 1.54-510.fc41                  fedora      46.5 KiB
 perl-Class-Struct              noarch 0.68-509.fc41                  fedora      25.4 KiB
 perl-Data-Dumper               x86_64 2.189-511.fc41                 fedora     111.7 KiB
 perl-Digest                    noarch 1.20-510.fc41                  fedora      35.2 KiB
 perl-Digest-MD5                x86_64 2.59-4.fc41                    fedora      59.7 KiB
 perl-DynaLoader                x86_64 1.56-509.fc41                  fedora      32.1 KiB
 perl-Encode                    x86_64 4:3.21-510.fc41                fedora       4.7 MiB
 perl-Errno                     x86_64 1.38-509.fc41                  fedora       8.4 KiB
 perl-Exporter                  noarch 5.78-510.fc41                  fedora      54.2 KiB
 perl-Fcntl                     x86_64 1.18-509.fc41                  fedora      45.0 KiB
 perl-File-Basename             noarch 2.86-509.fc41                  fedora      14.0 KiB
 perl-File-Compare              noarch 1.100.800-509.fc41             fedora       5.6 KiB
 perl-File-Copy                 noarch 2.41-509.fc41                  fedora      19.6 KiB
 perl-File-Find                 noarch 1.44-509.fc41                  fedora      41.9 KiB
 perl-File-Path                 noarch 2.18-510.fc41                  fedora      63.5 KiB
 perl-File-Temp                 noarch 1:0.231.100-510.fc41           fedora     162.3 KiB
 perl-File-stat                 noarch 1.14-509.fc41                  fedora      12.5 KiB
 perl-FileHandle                noarch 2.05-509.fc41                  fedora       9.3 KiB
 perl-Getopt-Long               noarch 1:2.58-1.fc41                  fedora     144.4 KiB
 perl-Getopt-Std                noarch 1.14-509.fc41                  fedora      11.2 KiB
 perl-HTTP-Tiny                 noarch 0.088-511.fc41                 fedora     152.1 KiB
 perl-IO                        x86_64 1.55-509.fc41                  fedora     151.1 KiB
 perl-IO-Socket-IP              noarch 0.42-511.fc41                  fedora      98.6 KiB
 perl-IO-Socket-SSL             noarch 2.085-1.fc40                   fedora     685.0 KiB
 perl-IPC-Open3                 noarch 1.22-509.fc41                  fedora      22.5 KiB
 perl-MIME-Base64               x86_64 3.16-510.fc41                  fedora      46.1 KiB
 perl-Mozilla-CA                noarch 20240313-1.fc41                fedora       9.5 KiB
 perl-Net-SSLeay                x86_64 1.94-4.fc41                    fedora       1.3 MiB
 perl-POSIX                     x86_64 2.20-509.fc41                  fedora     235.1 KiB
 perl-PathTools                 x86_64 3.91-510.fc41                  fedora     179.6 KiB
 perl-Pod-Escapes               noarch 1:1.07-510.fc41                fedora      24.9 KiB
 perl-Pod-Perldoc               noarch 3.28.01-511.fc41               fedora     163.1 KiB
 perl-Pod-Simple                noarch 1:3.45-510.fc41                fedora     559.8 KiB
 perl-Pod-Usage                 noarch 4:2.03-510.fc41                fedora      84.7 KiB
 perl-Scalar-List-Utils         x86_64 5:1.63-510.fc41                fedora     145.5 KiB
 perl-SelectSaver               noarch 1.02-509.fc41                  fedora       2.2 KiB
 perl-Socket                    x86_64 4:2.038-510.fc41               fedora     124.0 KiB
 perl-Storable                  x86_64 1:3.32-510.fc41                fedora     232.3 KiB
 perl-Symbol                    noarch 1.09-509.fc41                  fedora       6.8 KiB
 perl-Term-ANSIColor            noarch 5.01-511.fc41                  fedora      97.5 KiB
 perl-Term-Cap                  noarch 1.18-510.fc41                  fedora      29.3 KiB
 perl-Text-ParseWords           noarch 3.31-510.fc41                  fedora      13.5 KiB
 perl-Text-Tabs+Wrap            noarch 2024.001-510.fc41              fedora      22.5 KiB
 perl-Thread-Queue              noarch 3.14-510.fc41                  fedora      28.8 KiB
 perl-Time-Local                noarch 2:1.350-510.fc41               fedora      68.9 KiB
 perl-URI                       noarch 5.28-1.fc41                    fedora     240.2 KiB
 perl-base                      noarch 2.27-509.fc41                  fedora      12.5 KiB
 perl-constant                  noarch 1.33-511.fc41                  fedora      26.2 KiB
 perl-if                        noarch 0.61.000-509.fc41              fedora       5.8 KiB
 perl-interpreter               x86_64 4:5.40.0-509.fc41              fedora     122.3 KiB
 perl-libnet                    noarch 3.15-511.fc41                  fedora     289.0 KiB
 perl-libs                      x86_64 4:5.40.0-509.fc41              fedora       9.8 MiB
 perl-locale                    noarch 1.12-509.fc41                  fedora       6.5 KiB
 perl-mro                       x86_64 1.29-509.fc41                  fedora      45.6 KiB
 perl-overload                  noarch 1.37-509.fc41                  fedora      71.5 KiB
 perl-overloading               noarch 0.02-509.fc41                  fedora       4.8 KiB
 perl-parent                    noarch 1:0.241-510.fc41               fedora       9.7 KiB
 perl-podlators                 noarch 1:5.01-510.fc41                fedora     308.1 KiB
 perl-threads                   x86_64 1:2.40-510.fc41                fedora     115.1 KiB
 perl-threads-shared            x86_64 1.69-510.fc41                  fedora      83.7 KiB
 perl-vars                      noarch 1.05-509.fc41                  fedora       3.9 KiB
 pyproject-rpm-macros           noarch 1.12.2-1.fc41                  fedora      99.6 KiB
 python-pip-wheel               noarch 24.1.1-1.fc41                  fedora       1.2 MiB
 python-rpm-macros              noarch 3.13-2.fc41                    fedora      22.1 KiB
 python3                        x86_64 3.13.0~b3-1.fc41               fedora      31.8 KiB
 python3-babel                  noarch 2.15.0-3.fc41                  fedora      28.4 MiB
 python3-charset-normalizer     noarch 3.3.2-4.fc41                   fedora     315.0 KiB
 python3-docutils               noarch 0.20.1-5.fc41                  fedora       4.9 MiB
 python3-idna                   noarch 3.7-2.fc41                     fedora     595.9 KiB
 python3-imagesize              noarch 1.4.1-8.fc41                   fedora      35.3 KiB
 python3-jinja2                 noarch 3.1.4-4.fc41                   fedora       2.9 MiB
 python3-libs                   x86_64 3.13.0~b3-1.fc41               fedora      40.5 MiB
 python3-markupsafe             x86_64 2.1.5-2.fc41                   fedora      57.5 KiB
 python3-packaging              noarch 24.1-1.fc41                    fedora     422.7 KiB
 python3-pygments               noarch 2.17.2-6.fc41                  fedora      10.4 MiB
 python3-requests               noarch 2.32.3-1.fc41                  fedora     486.1 KiB
 python3-rpm-generators         noarch 14-10.fc40                     fedora      81.7 KiB
 python3-rpm-macros             noarch 3.13-2.fc41                    fedora       6.4 KiB
 python3-snowballstemmer        noarch 2.2.0-11.fc41                  fedora       1.7 MiB
 python3-sphinx-theme-alabaster noarch 0.7.16-5.fc41                  fedora      41.9 KiB
 python3-sphinxcontrib-jquery   noarch 4.1-8.fc41                     fedora     381.8 KiB
 python3-urllib3                noarch 1.26.19-1.fc41                 fedora       1.0 MiB
 tzdata                         noarch 2024a-8.fc41                   fedora       1.7 MiB

Transaction Summary:
 Installing:      133 packages

Total size of inbound packages is 107 MiB. Need to download 107 MiB.
After this operation 378 MiB will be used (install 378 MiB, remove 0 B).
[  1/133] httpd-devel-0:2.4.59-2.fc41.x 100% |   3.8 MiB/s | 206.1 KiB |  00m00s
[  2/133] make-1:4.4.1-6.fc40.x86_64    100% |   9.9 MiB/s | 587.6 KiB |  00m00s
[  3/133] python3-setuptools-0:69.2.0-6 100% |  39.2 MiB/s |   1.6 MiB |  00m00s
[  4/133] python3-sphinx-1:7.2.6-8.fc41 100% |  42.4 MiB/s |   2.6 MiB |  00m00s
[  5/133] python3-sphinx_rtd_theme-0:2. 100% |   1.7 MiB/s |  84.2 KiB |  00m00s
[  6/133] python3-devel-0:3.13.0~b3-1.f 100% |   8.5 MiB/s | 399.8 KiB |  00m00s
[  7/133] libmpc-0:1.3.1-5.fc40.x86_64  100% |   1.1 MiB/s |  71.1 KiB |  00m00s
[  8/133] cpp-0:14.1.1-6.fc41.x86_64    100% |  75.2 MiB/s |  12.0 MiB |  00m00s
[  9/133] httpd-core-0:2.4.59-2.fc41.x8 100% |  15.8 MiB/s |   1.4 MiB |  00m00s
[ 10/133] libtool-0:2.4.7-11.fc41.x86_6 100% |  13.6 MiB/s | 600.1 KiB |  00m00s
[ 11/133] gcc-0:14.1.1-6.fc41.x86_64    100% |  76.5 MiB/s |  37.0 MiB |  00m00s
[ 12/133] perl-interpreter-4:5.40.0-509 100% | 436.9 KiB/s |  72.5 KiB |  00m00s
[ 13/133] guile30-0:3.0.9-1.fc41.x86_64 100% |  41.1 MiB/s |   8.3 MiB |  00m00s
[ 14/133] python3-docutils-0:0.20.1-5.f 100% |  11.0 MiB/s |   1.1 MiB |  00m00s
[ 15/133] python3-babel-0:2.15.0-3.fc41 100% |  53.6 MiB/s |   6.5 MiB |  00m00s
[ 16/133] python3-imagesize-0:1.4.1-8.f 100% | 366.9 KiB/s |  22.0 KiB |  00m00s
[ 17/133] python3-jinja2-0:3.1.4-4.fc41 100% |  16.1 MiB/s | 493.6 KiB |  00m00s
[ 18/133] python3-packaging-0:24.1-1.fc 100% |  13.6 MiB/s | 125.7 KiB |  00m00s
[ 19/133] python3-pygments-0:2.17.2-6.f 100% |  95.5 MiB/s |   2.5 MiB |  00m00s
[ 20/133] python3-requests-0:2.32.3-1.f 100% |   6.5 MiB/s | 159.6 KiB |  00m00s
[ 21/133] python3-snowballstemmer-0:2.2 100% |  10.1 MiB/s | 259.1 KiB |  00m00s
[ 22/133] python3-sphinx-theme-alabaste 100% |   2.9 MiB/s |  24.1 KiB |  00m00s
[ 23/133] fontawesome4-fonts-1:4.7.0-22 100% |  16.6 MiB/s | 204.4 KiB |  00m00s
[ 24/133] google-roboto-slab-fonts-0:1. 100% |  19.4 MiB/s | 238.8 KiB |  00m00s
[ 25/133] python3-sphinxcontrib-jquery- 100% |   4.4 MiB/s | 113.8 KiB |  00m00s
[ 26/133] lato-fonts-0:2.015-20.fc40.no 100% |  58.6 MiB/s |   3.1 MiB |  00m00s
[ 27/133] python3-libs-0:3.13.0~b3-1.fc 100% |  98.8 MiB/s |   9.1 MiB |  00m00s
[ 28/133] apr-0:1.7.3-8.fc40.x86_64     100% |   1.7 MiB/s | 127.9 KiB |  00m00s
[ 29/133] apr-util-0:1.6.3-17.fc41.x86_ 100% |   1.6 MiB/s |  97.1 KiB |  00m00s
[ 30/133] apr-util-lmdb-0:1.6.3-17.fc41 100% |   1.4 MiB/s |  14.1 KiB |  00m00s
[ 31/133] httpd-filesystem-0:2.4.59-2.f 100% |   1.2 MiB/s |  12.4 KiB |  00m00s
[ 32/133] autoconf-0:2.72-2.fc41.noarch 100% |  54.0 MiB/s | 830.1 KiB |  00m00s
[ 33/133] httpd-tools-0:2.4.59-2.fc41.x 100% |   4.3 MiB/s |  80.0 KiB |  00m00s
[ 34/133] mailcap-0:2.1.54-5.fc40.noarc 100% |   1.7 MiB/s |  34.1 KiB |  00m00s
[ 35/133] automake-0:1.16.5-16.fc40.noa 100% |  52.4 MiB/s | 697.2 KiB |  00m00s
[ 36/133] perl-libs-4:5.40.0-509.fc41.x 100% |  80.4 MiB/s |   2.3 MiB |  00m00s
[ 37/133] gc-0:8.2.2-6.fc40.x86_64      100% |   3.7 MiB/s | 110.2 KiB |  00m00s
[ 38/133] python3-markupsafe-0:2.1.5-2. 100% |   1.5 MiB/s |  30.7 KiB |  00m00s
[ 39/133] python3-charset-normalizer-0: 100% |  11.6 MiB/s | 107.2 KiB |  00m00s
[ 40/133] python3-idna-0:3.7-2.fc41.noa 100% |  12.6 MiB/s | 115.8 KiB |  00m00s
[ 41/133] python3-urllib3-0:1.26.19-1.f 100% |  21.0 MiB/s | 279.9 KiB |  00m00s
[ 42/133] fonts-filesystem-1:2.0.5-16.f 100% | 932.5 KiB/s |   8.4 KiB |  00m00s
[ 43/133] expat-0:2.6.2-1.fc41.x86_64   100% |  12.3 MiB/s | 113.2 KiB |  00m00s
[ 44/133] libb2-0:0.98.1-11.fc40.x86_64 100% |   3.1 MiB/s |  25.5 KiB |  00m00s
[ 45/133] mpdecimal-0:2.5.1-9.fc40.x86_ 100% |   8.7 MiB/s |  88.6 KiB |  00m00s
[ 46/133] python-pip-wheel-0:24.1.1-1.f 100% |  75.5 MiB/s |   1.2 MiB |  00m00s
[ 47/133] tzdata-0:2024a-8.fc41.noarch  100% |  34.9 MiB/s | 714.9 KiB |  00m00s
[ 48/133] lmdb-libs-0:0.9.33-1.fc41.x86 100% |   3.0 MiB/s |  61.5 KiB |  00m00s
[ 49/133] emacs-filesystem-1:30.0-2.fc4 100% | 709.4 KiB/s |   7.1 KiB |  00m00s
[ 50/133] m4-0:1.4.19-9.fc40.x86_64     100% |  29.8 MiB/s | 305.5 KiB |  00m00s
[ 51/133] perl-Carp-0:1.54-510.fc41.noa 100% |   1.9 MiB/s |  28.7 KiB |  00m00s
[ 52/133] perl-Class-Struct-0:0.68-509. 100% |   1.3 MiB/s |  22.2 KiB |  00m00s
[ 53/133] perl-Data-Dumper-0:2.189-511. 100% |   3.4 MiB/s |  56.2 KiB |  00m00s
[ 54/133] perl-Errno-0:1.38-509.fc41.x8 100% | 795.5 KiB/s |  15.1 KiB |  00m00s
[ 55/133] perl-Exporter-0:5.78-510.fc41 100% | 767.5 KiB/s |  30.7 KiB |  00m00s
[ 56/133] perl-File-Basename-0:2.86-509 100% | 376.4 KiB/s |  17.3 KiB |  00m00s
[ 57/133] perl-File-Compare-0:1.100.800 100% | 273.7 KiB/s |  13.4 KiB |  00m00s
[ 58/133] perl-File-Copy-0:2.41-509.fc4 100% | 337.9 KiB/s |  20.3 KiB |  00m00s
[ 59/133] perl-File-Find-0:1.44-509.fc4 100% | 265.5 KiB/s |  25.5 KiB |  00m00s
[ 60/133] perl-File-Temp-1:0.231.100-51 100% | 418.3 KiB/s |  59.0 KiB |  00m00s
[ 61/133] perl-File-stat-0:1.14-509.fc4 100% | 162.4 KiB/s |  17.2 KiB |  00m00s
[ 62/133] perl-Getopt-Long-1:2.58-1.fc4 100% | 636.1 KiB/s |  63.6 KiB |  00m00s
[ 63/133] perl-IO-0:1.55-509.fc41.x86_6 100% |   1.3 MiB/s |  82.0 KiB |  00m00s
[ 64/133] perl-POSIX-0:2.20-509.fc41.x8 100% |   1.3 MiB/s |  97.2 KiB |  00m00s
[ 65/133] perl-PathTools-0:3.91-510.fc4 100% |   1.5 MiB/s |  86.9 KiB |  00m00s
[ 66/133] perl-Text-ParseWords-0:3.31-5 100% | 463.3 KiB/s |  16.2 KiB |  00m00s
[ 67/133] perl-constant-0:1.33-511.fc41 100% |   1.3 MiB/s |  22.8 KiB |  00m00s
[ 68/133] perl-File-Path-0:2.18-510.fc4 100% |   3.1 MiB/s |  35.0 KiB |  00m00s
[ 69/133] perl-Thread-Queue-0:3.14-510. 100% |   2.1 MiB/s |  21.2 KiB |  00m00s
[ 70/133] perl-threads-1:2.40-510.fc41. 100% |   3.8 MiB/s |  57.8 KiB |  00m00s
[ 71/133] perl-DynaLoader-0:1.56-509.fc 100% |   2.3 MiB/s |  26.2 KiB |  00m00s
[ 72/133] perl-B-0:1.89-509.fc41.x86_64 100% |   6.9 MiB/s | 176.4 KiB |  00m00s
[ 73/133] perl-Scalar-List-Utils-5:1.63 100% |   3.2 MiB/s |  72.4 KiB |  00m00s
[ 74/133] perl-overload-0:1.37-509.fc41 100% |   2.0 MiB/s |  45.7 KiB |  00m00s
[ 75/133] perl-Fcntl-0:1.18-509.fc41.x8 100% |   3.7 MiB/s |  30.0 KiB |  00m00s
[ 76/133] perl-parent-1:0.241-510.fc41. 100% |   1.8 MiB/s |  14.8 KiB |  00m00s
[ 77/133] perl-Symbol-0:1.09-509.fc41.n 100% |   2.0 MiB/s |  14.4 KiB |  00m00s
[ 78/133] perl-Pod-Usage-4:2.03-510.fc4 100% |   4.3 MiB/s |  39.8 KiB |  00m00s
[ 79/133] perl-base-0:2.27-509.fc41.noa 100% |   1.8 MiB/s |  16.4 KiB |  00m00s
[ 80/133] perl-SelectSaver-0:1.02-509.f 100% |   1.7 MiB/s |  11.9 KiB |  00m00s
[ 81/133] perl-Socket-4:2.038-510.fc41. 100% |   5.3 MiB/s |  54.7 KiB |  00m00s
[ 82/133] perl-locale-0:1.12-509.fc41.n 100% |   1.7 MiB/s |  13.8 KiB |  00m00s
[ 83/133] perl-vars-0:1.05-509.fc41.noa 100% |   1.6 MiB/s |  13.2 KiB |  00m00s
[ 84/133] perl-threads-shared-0:1.69-51 100% |   4.8 MiB/s |  44.6 KiB |  00m00s
[ 85/133] perl-if-0:0.61.000-509.fc41.n 100% |   1.5 MiB/s |  14.2 KiB |  00m00s
[ 86/133] perl-overloading-0:0.02-509.f 100% |   1.4 MiB/s |  13.1 KiB |  00m00s
[ 87/133] perl-mro-0:1.29-509.fc41.x86_ 100% |   3.3 MiB/s |  30.1 KiB |  00m00s
[ 88/133] perl-Pod-Perldoc-0:3.28.01-51 100% |   6.9 MiB/s |  85.2 KiB |  00m00s
[ 89/133] perl-podlators-1:5.01-510.fc4 100% |   7.2 MiB/s | 125.0 KiB |  00m00s
[ 90/133] groff-base-0:1.23.0-6.fc40.x8 100% |  19.6 MiB/s |   1.1 MiB |  00m00s
[ 91/133] perl-HTTP-Tiny-0:0.088-511.fc 100% |   1.0 MiB/s |  55.7 KiB |  00m00s
[ 92/133] perl-IPC-Open3-0:1.22-509.fc4 100% | 458.4 KiB/s |  22.0 KiB |  00m00s
[ 93/133] perl-Pod-Simple-1:3.45-510.fc 100% |  15.2 MiB/s | 217.9 KiB |  00m00s
[ 94/133] perl-Term-ANSIColor-0:5.01-51 100% |   3.3 MiB/s |  47.5 KiB |  00m00s
[ 95/133] perl-Term-Cap-0:1.18-510.fc41 100% |   1.5 MiB/s |  21.9 KiB |  00m00s
[ 96/133] perl-IO-Socket-SSL-0:2.085-1. 100% |  14.0 MiB/s | 228.6 KiB |  00m00s
[ 97/133] perl-Mozilla-CA-0:20240313-1. 100% |   1.0 MiB/s |  14.0 KiB |  00m00s
[ 98/133] perl-MIME-Base64-0:3.16-510.f 100% |   1.8 MiB/s |  29.7 KiB |  00m00s
[ 99/133] perl-Net-SSLeay-0:1.94-4.fc41 100% |  19.4 MiB/s | 376.7 KiB |  00m00s
[100/133] perl-Time-Local-2:1.350-510.f 100% |   1.7 MiB/s |  34.4 KiB |  00m00s
[101/133] perl-Pod-Escapes-1:1.07-510.f 100% | 983.8 KiB/s |  19.7 KiB |  00m00s
[102/133] perl-Text-Tabs+Wrap-0:2024.00 100% |   2.1 MiB/s |  21.7 KiB |  00m00s
[103/133] ncurses-0:6.4-12.20240127.fc4 100% |  21.7 MiB/s | 421.2 KiB |  00m00s
[104/133] perl-IO-Socket-IP-0:0.42-511. 100% |   1.9 MiB/s |  41.7 KiB |  00m00s
[105/133] perl-URI-0:5.28-1.fc41.noarch 100% |   7.2 MiB/s | 132.7 KiB |  00m00s
[106/133] perl-AutoLoader-0:5.74-509.fc 100% |   2.6 MiB/s |  21.4 KiB |  00m00s
[107/133] perl-libnet-0:3.15-511.fc41.n 100% |  11.4 MiB/s | 127.9 KiB |  00m00s
[108/133] perl-Digest-MD5-0:2.59-4.fc41 100% |   2.9 MiB/s |  35.8 KiB |  00m00s
[109/133] perl-FileHandle-0:2.05-509.fc 100% |   1.1 MiB/s |  15.7 KiB |  00m00s
[110/133] perl-Digest-0:1.20-510.fc41.n 100% |   2.4 MiB/s |  24.6 KiB |  00m00s
[111/133] annobin-plugin-gcc-0:12.60-1. 100% |  31.5 MiB/s | 966.5 KiB |  00m00s
[112/133] gcc-plugin-annobin-0:14.1.1-6 100% |   1.9 MiB/s |  51.9 KiB |  00m00s
[113/133] annobin-docs-0:12.60-1.fc41.n 100% |   2.8 MiB/s |  90.0 KiB |  00m00s
[114/133] pyproject-rpm-macros-0:1.12.2 100% |   2.3 MiB/s |  40.7 KiB |  00m00s
[115/133] python-rpm-macros-0:3.13-2.fc 100% |   1.1 MiB/s |  17.8 KiB |  00m00s
[116/133] python3-rpm-generators-0:14-1 100% |   1.6 MiB/s |  29.6 KiB |  00m00s
[117/133] python3-rpm-macros-0:3.13-2.f 100% |   1.2 MiB/s |  12.5 KiB |  00m00s
[118/133] python3-0:3.13.0~b3-1.fc41.x8 100% |   1.4 MiB/s |  26.3 KiB |  00m00s
[119/133] perl-Encode-4:3.21-510.fc41.x 100% |  37.6 MiB/s |   1.1 MiB |  00m00s
[120/133] perl-Getopt-Std-0:1.14-509.fc 100% | 528.3 KiB/s |  15.8 KiB |  00m00s
[121/133] perl-Storable-1:3.32-510.fc41 100% |   4.0 MiB/s |  98.2 KiB |  00m00s
[122/133] apr-util-devel-0:1.6.3-17.fc4 100% |   6.9 MiB/s |  77.8 KiB |  00m00s
[123/133] apr-devel-0:1.7.3-8.fc40.x86_ 100% |  15.2 MiB/s | 234.1 KiB |  00m00s
[124/133] expat-devel-0:2.6.2-1.fc41.x8 100% |   3.3 MiB/s |  53.9 KiB |  00m00s
[125/133] openldap-devel-0:2.6.8-3.fc41 100% |  29.7 MiB/s | 730.8 KiB |  00m00s
[126/133] cyrus-sasl-devel-0:2.1.28-24. 100% |  11.0 MiB/s | 112.2 KiB |  00m00s
[127/133] cyrus-sasl-0:2.1.28-24.fc41.x 100% |   7.2 MiB/s |  73.8 KiB |  00m00s
[128/133] glibc-devel-0:2.39.9000-26.fc 100% |  12.9 MiB/s | 132.1 KiB |  00m00s
[129/133] glibc-headers-x86-0:2.39.9000 100% |  32.1 MiB/s | 623.7 KiB |  00m00s
[130/133] libxcrypt-devel-0:4.4.36-5.fc 100% |   3.5 MiB/s |  28.6 KiB |  00m00s
[131/133] kernel-headers-0:6.10.0-0.rc6 100% |  51.8 MiB/s |   1.6 MiB |  00m00s
[132/133] lmdb-0:0.9.33-1.fc41.x86_64   100% | 282.7 KiB/s |  32.5 KiB |  00m00s
[133/133] lmdb-devel-0:0.9.33-1.fc41.x8 100% |  85.9 KiB/s |  25.9 KiB |  00m00s
--------------------------------------------------------------------------------
[133/133] Total                         100% |  57.7 MiB/s | 106.7 MiB |  00m02s
Running transaction
[  1/135] Verify package files          100% | 355.0   B/s | 133.0   B |  00m00s
[  2/135] Prepare transaction           100% |   1.5 KiB/s | 133.0   B |  00m00s
[  3/135] Installing apr-0:1.7.3-8.fc40 100% |  48.0 MiB/s | 295.1 KiB |  00m00s
[  4/135] Installing python-rpm-macros- 100% |   7.4 MiB/s |  22.8 KiB |  00m00s
[  5/135] Installing lmdb-libs-0:0.9.33 100% |  36.1 MiB/s | 111.0 KiB |  00m00s
[  6/135] Installing expat-0:2.6.2-1.fc 100% |  55.3 MiB/s | 282.9 KiB |  00m00s
[  7/135] Installing apr-util-0:1.6.3-1 100% |  54.2 MiB/s | 222.0 KiB |  00m00s
[  8/135] Installing fonts-filesystem-1 100% | 256.5 KiB/s | 788.0   B |  00m00s
[  9/135] Installing python3-rpm-macros 100% |   3.3 MiB/s |   6.7 KiB |  00m00s
[ 10/135] Installing libmpc-0:1.3.1-5.f 100% |  40.6 MiB/s | 166.2 KiB |  00m00s
[ 11/135] Installing cpp-0:14.1.1-6.fc4 100% | 346.5 MiB/s |  35.0 MiB |  00m00s
[ 12/135] Installing pyproject-rpm-macr 100% |  24.8 MiB/s | 101.6 KiB |  00m00s
[ 13/135] Installing fontawesome4-fonts 100% |  72.7 MiB/s | 297.8 KiB |  00m00s
[ 14/135] Installing google-roboto-slab 100% | 171.2 MiB/s | 701.4 KiB |  00m00s
[ 15/135] Installing lato-fonts-0:2.015 100% | 343.5 MiB/s |  11.3 MiB |  00m00s
[ 16/135] Installing apr-util-lmdb-0:1. 100% |   7.8 MiB/s |  16.1 KiB |  00m00s
[ 17/135] Installing httpd-tools-0:2.4. 100% |  39.8 MiB/s | 203.6 KiB |  00m00s
[ 18/135] Installing expat-devel-0:2.6. 100% |  66.8 MiB/s | 205.1 KiB |  00m00s
[ 19/135] Installing lmdb-0:0.9.33-1.fc 100% |  18.9 MiB/s |  77.2 KiB |  00m00s
[ 20/135] Installing lmdb-devel-0:0.9.3 100% |  14.3 MiB/s |  73.0 KiB |  00m00s
[ 21/135] Installing kernel-headers-0:6 100% | 119.4 MiB/s |   6.4 MiB |  00m00s
[ 22/135] Installing glibc-headers-x86- 100% |  95.2 MiB/s |   2.3 MiB |  00m00s
[ 23/135] Installing libxcrypt-devel-0: 100% |  10.6 MiB/s |  32.6 KiB |  00m00s
[ 24/135] Installing glibc-devel-0:2.39 100% | 794.5 KiB/s |  40.5 KiB |  00m00s
>>> Running pre-install scriptlet: cyrus-sasl-0:2.1.28-24.fc41.x86_64
>>> Stop pre-install scriptlet: cyrus-sasl-0:2.1.28-24.fc41.x86_64
[ 25/135] Installing cyrus-sasl-0:2.1.2 100% |  16.1 MiB/s | 148.3 KiB |  00m00s
>>> Running post-install scriptlet: cyrus-sasl-0:2.1.28-24.fc41.x86_64
>>> Stop post-install scriptlet: cyrus-sasl-0:2.1.28-24.fc41.x86_64
[ 26/135] Installing cyrus-sasl-devel-0 100% |  30.2 MiB/s | 216.2 KiB |  00m00s
[ 27/135] Installing openldap-devel-0:2 100% | 179.6 MiB/s |   3.8 MiB |  00m00s
[ 28/135] Installing annobin-docs-0:12. 100% |  31.7 MiB/s |  97.4 KiB |  00m00s
[ 29/135] Installing ncurses-0:6.4-12.2 100% |  55.7 MiB/s | 627.6 KiB |  00m00s
>>> Running pre-install scriptlet: groff-base-0:1.23.0-6.fc40.x86_64
>>> Stop pre-install scriptlet: groff-base-0:1.23.0-6.fc40.x86_64
[ 30/135] Installing groff-base-0:1.23. 100% | 137.8 MiB/s |   3.9 MiB |  00m00s
>>> Running post-install scriptlet: groff-base-0:1.23.0-6.fc40.x86_64
>>> Stop post-install scriptlet: groff-base-0:1.23.0-6.fc40.x86_64
[ 31/135] Installing perl-Digest-0:1.20 100% |   9.0 MiB/s |  37.0 KiB |  00m00s
[ 32/135] Installing perl-B-0:1.89-509. 100% |  97.1 MiB/s | 497.2 KiB |  00m00s
[ 33/135] Installing perl-FileHandle-0: 100% |   4.8 MiB/s |   9.8 KiB |  00m00s
[ 34/135] Installing perl-Digest-MD5-0: 100% |  15.0 MiB/s |  61.6 KiB |  00m00s
[ 35/135] Installing perl-Data-Dumper-0 100% |  27.7 MiB/s | 113.6 KiB |  00m00s
[ 36/135] Installing perl-libnet-0:3.15 100% |  57.5 MiB/s | 294.3 KiB |  00m00s
[ 37/135] Installing perl-IO-Socket-IP- 100% |  32.7 MiB/s | 100.4 KiB |  00m00s
[ 38/135] Installing perl-AutoLoader-0: 100% |  10.2 MiB/s |  20.9 KiB |  00m00s
[ 39/135] Installing perl-URI-0:5.28-1. 100% |  35.1 MiB/s | 251.8 KiB |  00m00s
[ 40/135] Installing perl-locale-0:1.12 100% |   3.4 MiB/s |   6.9 KiB |  00m00s
[ 41/135] Installing perl-File-Path-0:2 100% |  31.5 MiB/s |  64.5 KiB |  00m00s
[ 42/135] Installing perl-if-0:0.61.000 100% |   3.0 MiB/s |   6.2 KiB |  00m00s
[ 43/135] Installing perl-Mozilla-CA-0: 100% |   5.1 MiB/s |  10.5 KiB |  00m00s
[ 44/135] Installing perl-Time-Local-2: 100% |  23.0 MiB/s |  70.5 KiB |  00m00s
[ 45/135] Installing perl-Pod-Escapes-1 100% |   8.4 MiB/s |  25.9 KiB |  00m00s
[ 46/135] Installing perl-Text-Tabs+Wra 100% |   7.8 MiB/s |  23.8 KiB |  00m00s
[ 47/135] Installing perl-Net-SSLeay-0: 100% | 123.9 MiB/s |   1.4 MiB |  00m00s
[ 48/135] Installing perl-IO-Socket-SSL 100% | 112.1 MiB/s | 689.0 KiB |  00m00s
[ 49/135] Installing perl-Class-Struct- 100% |  12.6 MiB/s |  25.9 KiB |  00m00s
[ 50/135] Installing perl-POSIX-0:2.20- 100% |  77.0 MiB/s | 236.4 KiB |  00m00s
[ 51/135] Installing perl-File-Temp-1:0 100% |  40.0 MiB/s | 164.0 KiB |  00m00s
[ 52/135] Installing perl-IPC-Open3-0:1 100% |  11.4 MiB/s |  23.3 KiB |  00m00s
[ 53/135] Installing perl-Term-ANSIColo 100% |  32.3 MiB/s |  99.1 KiB |  00m00s
[ 54/135] Installing perl-Term-Cap-0:1. 100% |   9.9 MiB/s |  30.5 KiB |  00m00s
[ 55/135] Installing perl-Pod-Simple-1: 100% |  92.7 MiB/s | 569.4 KiB |  00m00s
[ 56/135] Installing perl-HTTP-Tiny-0:0 100% |  37.6 MiB/s | 154.2 KiB |  00m00s
[ 57/135] Installing perl-Symbol-0:1.09 100% |   3.5 MiB/s |   7.2 KiB |  00m00s
[ 58/135] Installing perl-SelectSaver-0 100% |   1.3 MiB/s |   2.6 KiB |  00m00s
[ 59/135] Installing perl-Socket-4:2.03 100% |  30.8 MiB/s | 126.0 KiB |  00m00s
[ 60/135] Installing perl-File-stat-0:1 100% |   4.2 MiB/s |  13.1 KiB |  00m00s
[ 61/135] Installing perl-podlators-1:5 100% |  61.0 MiB/s | 312.1 KiB |  00m00s
[ 62/135] Installing perl-Pod-Perldoc-0 100% |  32.9 MiB/s | 168.6 KiB |  00m00s
[ 63/135] Installing perl-Text-ParseWor 100% |   4.7 MiB/s |  14.5 KiB |  00m00s
[ 64/135] Installing perl-Fcntl-0:1.18- 100% |  15.0 MiB/s |  46.1 KiB |  00m00s
[ 65/135] Installing perl-base-0:2.27-5 100% |   6.3 MiB/s |  12.9 KiB |  00m00s
[ 66/135] Installing perl-overloading-0 100% |   1.8 MiB/s |   5.5 KiB |  00m00s
[ 67/135] Installing perl-IO-0:1.55-509 100% |  37.9 MiB/s | 155.4 KiB |  00m00s
[ 68/135] Installing perl-mro-0:1.29-50 100% |  15.2 MiB/s |  46.7 KiB |  00m00s
[ 69/135] Installing perl-Pod-Usage-4:2 100% |  21.1 MiB/s |  86.3 KiB |  00m00s
[ 70/135] Installing perl-Errno-0:1.38- 100% |   2.9 MiB/s |   8.8 KiB |  00m00s
[ 71/135] Installing perl-File-Basename 100% |   7.1 MiB/s |  14.6 KiB |  00m00s
[ 72/135] Installing perl-constant-0:1. 100% |   8.9 MiB/s |  27.4 KiB |  00m00s
[ 73/135] Installing perl-Scalar-List-U 100% |  29.0 MiB/s | 148.7 KiB |  00m00s
[ 74/135] Installing perl-parent-1:0.24 100% |   5.1 MiB/s |  10.4 KiB |  00m00s
[ 75/135] Installing perl-vars-0:1.05-5 100% |   2.1 MiB/s |   4.3 KiB |  00m00s
[ 76/135] Installing perl-overload-0:1. 100% |  23.4 MiB/s |  71.9 KiB |  00m00s
[ 77/135] Installing perl-MIME-Base64-0 100% |  11.8 MiB/s |  48.3 KiB |  00m00s
[ 78/135] Installing perl-Getopt-Std-0: 100% |   5.7 MiB/s |  11.7 KiB |  00m00s
[ 79/135] Installing perl-Storable-1:3. 100% |  57.1 MiB/s | 233.9 KiB |  00m00s
[ 80/135] Installing perl-Getopt-Long-1 100% |  47.9 MiB/s | 147.1 KiB |  00m00s
[ 81/135] Installing perl-Carp-0:1.54-5 100% |  15.5 MiB/s |  47.7 KiB |  00m00s
[ 82/135] Installing perl-Exporter-0:5. 100% |  13.6 MiB/s |  55.6 KiB |  00m00s
[ 83/135] Installing perl-PathTools-0:3 100% |  36.0 MiB/s | 184.2 KiB |  00m00s
[ 84/135] Installing perl-DynaLoader-0: 100% |  15.9 MiB/s |  32.5 KiB |  00m00s
[ 85/135] Installing perl-Encode-4:3.21 100% | 248.3 MiB/s |   4.7 MiB |  00m00s
[ 86/135] Installing perl-libs-4:5.40.0 100% | 184.1 MiB/s |   9.9 MiB |  00m00s
[ 87/135] Installing perl-interpreter-4 100% |  40.4 MiB/s | 124.0 KiB |  00m00s
[ 88/135] Installing perl-threads-1:2.4 100% |  28.6 MiB/s | 117.1 KiB |  00m00s
[ 89/135] Installing perl-threads-share 100% |  21.0 MiB/s |  85.9 KiB |  00m00s
[ 90/135] Installing perl-Thread-Queue- 100% |  14.8 MiB/s |  30.3 KiB |  00m00s
[ 91/135] Installing perl-File-Compare- 100% |   2.0 MiB/s |   6.1 KiB |  00m00s
[ 92/135] Installing perl-File-Copy-0:2 100% |   9.8 MiB/s |  20.2 KiB |  00m00s
[ 93/135] Installing perl-File-Find-0:1 100% |  20.7 MiB/s |  42.5 KiB |  00m00s
[ 94/135] Installing m4-0:1.4.19-9.fc40 100% |  64.6 MiB/s | 595.2 KiB |  00m00s
[ 95/135] Installing emacs-filesystem-1 100% | 177.1 KiB/s | 544.0   B |  00m00s
[ 96/135] Installing autoconf-0:2.72-2. 100% | 215.2 MiB/s |   2.8 MiB |  00m00s
[ 97/135] Installing automake-0:1.16.5- 100% | 103.6 MiB/s |   1.8 MiB |  00m00s
[ 98/135] Installing tzdata-0:2024a-8.f 100% |  32.3 MiB/s |   1.9 MiB |  00m00s
[ 99/135] Installing python-pip-wheel-0 100% | 208.3 MiB/s |   1.2 MiB |  00m00s
[100/135] Installing mpdecimal-0:2.5.1- 100% |  49.3 MiB/s | 202.0 KiB |  00m00s
[101/135] Installing libb2-0:0.98.1-11. 100% |   5.3 MiB/s |  43.3 KiB |  00m00s
[102/135] Installing python3-libs-0:3.1 100% | 249.0 MiB/s |  40.8 MiB |  00m00s
[103/135] Installing python3-0:3.13.0~b 100% |   6.6 MiB/s |  33.6 KiB |  00m00s
[104/135] Installing python3-docutils-0 100% | 156.8 MiB/s |   5.0 MiB |  00m00s
[105/135] Installing python3-packaging- 100% |  60.5 MiB/s | 433.5 KiB |  00m00s
[106/135] Installing python3-idna-0:3.7 100% |  98.0 MiB/s | 602.2 KiB |  00m00s
[107/135] Installing apr-devel-0:1.7.3- 100% | 114.6 MiB/s |   1.0 MiB |  00m00s
[108/135] Installing apr-util-devel-0:1 100% |  52.6 MiB/s | 323.3 KiB |  00m00s
[109/135] Installing python3-urllib3-0: 100% | 104.3 MiB/s |   1.0 MiB |  00m00s
[110/135] Installing python3-rpm-genera 100% |  16.2 MiB/s |  82.9 KiB |  00m00s
[111/135] Installing python3-babel-0:2. 100% | 248.8 MiB/s |  28.6 MiB |  00m00s
[112/135] Installing python3-imagesize- 100% |   7.5 MiB/s |  38.4 KiB |  00m00s
[113/135] Installing python3-pygments-0 100% | 179.9 MiB/s |  10.6 MiB |  00m00s
[114/135] Installing python3-snowballst 100% | 134.2 MiB/s |   1.7 MiB |  00m00s
[115/135] Installing python3-sphinx-the 100% |  11.3 MiB/s |  46.4 KiB |  00m00s
[116/135] Installing python3-markupsafe 100% |  12.0 MiB/s |  61.5 KiB |  00m00s
[117/135] Installing python3-jinja2-0:3 100% | 207.5 MiB/s |   2.9 MiB |  00m00s
[118/135] Installing python3-charset-no 100% |  45.3 MiB/s | 324.9 KiB |  00m00s
[119/135] Installing python3-requests-0 100% |  48.7 MiB/s | 498.2 KiB |  00m00s
[120/135] Installing python3-sphinx-1:7 100% | 165.1 MiB/s |  11.1 MiB |  00m00s
[121/135] Installing python3-sphinxcont 100% |  75.2 MiB/s | 385.0 KiB |  00m00s
[122/135] Installing gc-0:8.2.2-6.fc40. 100% |  42.5 MiB/s | 261.2 KiB |  00m00s
[123/135] Installing guile30-0:3.0.9-1. 100% | 366.6 MiB/s |  52.8 MiB |  00m00s
[124/135] Installing make-1:4.4.1-6.fc4 100% | 138.5 MiB/s |   1.8 MiB |  00m00s
[125/135] Installing gcc-0:14.1.1-6.fc4 100% | 390.1 MiB/s | 104.2 MiB |  00m00s
>>> Running trigger-install scriptlet: redhat-rpm-config-0:293-1.fc41.noarch
>>> Stop trigger-install scriptlet: redhat-rpm-config-0:293-1.fc41.noarch
[126/135] Installing libtool-0:2.4.7-11 100% | 221.1 MiB/s |   2.7 MiB |  00m00s
[127/135] Installing mailcap-0:2.1.54-5 100% |   2.5 MiB/s |  87.1 KiB |  00m00s
>>> Running pre-install scriptlet: httpd-filesystem-0:2.4.59-2.fc41.noarch
>>> Stop pre-install scriptlet: httpd-filesystem-0:2.4.59-2.fc41.noarch
[128/135] Installing httpd-filesystem-0 100% | 432.8 KiB/s |   2.2 KiB |  00m00s
[129/135] Installing httpd-core-0:2.4.5 100% | 120.4 MiB/s |   4.7 MiB |  00m00s
[130/135] Installing httpd-devel-0:2.4. 100% | 100.3 MiB/s | 924.2 KiB |  00m00s
[131/135] Installing annobin-plugin-gcc 100% |  68.2 MiB/s | 977.9 KiB |  00m00s
>>> Running trigger-install scriptlet: redhat-rpm-config-0:293-1.fc41.noarch
>>> Stop trigger-install scriptlet: redhat-rpm-config-0:293-1.fc41.noarch
[132/135] Installing gcc-plugin-annobin 100% |   4.1 MiB/s |  58.6 KiB |  00m00s
>>> Running trigger-install scriptlet: redhat-rpm-config-0:293-1.fc41.noarch
>>> Stop trigger-install scriptlet: redhat-rpm-config-0:293-1.fc41.noarch
[133/135] Installing python3-sphinx_rtd 100% |  30.0 MiB/s | 338.4 KiB |  00m00s
[134/135] Installing python3-devel-0:3. 100% |  86.0 MiB/s |   1.8 MiB |  00m00s
warning: posix.fork(): .fork(), .exec(), .wait() and .redirect2null() are deprecated, use rpm.execute() instead
warning: posix.wait(): .fork(), .exec(), .wait() and .redirect2null() are deprecated, use rpm.execute() instead
warning: posix.exec(): .fork(), .exec(), .wait() and .redirect2null() are deprecated, use rpm.execute() instead
[135/135] Installing python3-setuptools 100% |   2.7 MiB/s |   7.4 MiB |  00m03s
>>> Running trigger-install scriptlet: glibc-common-0:2.39.9000-26.fc41.x86_64
>>> Stop trigger-install scriptlet: glibc-common-0:2.39.9000-26.fc41.x86_64
>>> Running trigger-install scriptlet: info-0:7.1-2.fc40.x86_64
>>> Stop trigger-install scriptlet: info-0:7.1-2.fc40.x86_64

>>> 2024-07-03 16:13:19	"/usr/bin/mock" "-r" "fedora-41-x86_64" "--plugin-option=tmpfs:keep_mounted=True" "--config-opts=print_main_output=True" "--quiet" "--install" "tar" "clang" "cppcheck" "gcc" "ShellCheck"
Updating and loading repositories:
 fedora                                 100% |   1.2 MiB/s |  24.8 KiB |  00m00s
Repositories loaded.
Package "tar-2:1.35-3.fc40.x86_64" is already installed.
Package "gcc-14.1.1-6.fc41.x86_64" is already installed.

Package                    Arch   Version                 Repository      Size
Installing:
 ShellCheck                x86_64 0.10.0-1.fc41           fedora      33.9 MiB
 clang                     x86_64 18.1.7-1.fc41           fedora     587.7 KiB
 cppcheck                  x86_64 2.14.2-1.fc41           fedora      10.1 MiB
Installing dependencies:
 clang-libs                x86_64 18.1.7-1.fc41           fedora     107.8 MiB
 clang-resource-filesystem noarch 18.1.7-1.fc41           fedora     522.0   B
 gcc-c++                   x86_64 14.1.1-6.fc41           fedora      38.1 MiB
 libedit                   x86_64 3.1-51.20240517cvs.fc41 fedora     243.9 KiB
 libstdc++-devel           x86_64 14.1.1-6.fc41           fedora      15.4 MiB
 llvm-libs                 x86_64 18.1.7-1.fc41           fedora     113.5 MiB
 pcre                      x86_64 8.45-1.fc40.6           fedora     541.8 KiB
 tinyxml2                  x86_64 9.0.0-4.fc40            fedora     103.8 KiB

Transaction Summary:
 Installing:       11 packages

Total size of inbound packages is 76 MiB. Need to download 76 MiB.
After this operation 320 MiB will be used (install 320 MiB, remove 0 B).
[ 1/11] clang-0:18.1.7-1.fc41.x86_64    100% |   1.7 MiB/s |  78.6 KiB |  00m00s
[ 2/11] pcre-0:8.45-1.fc40.6.x86_64     100% |   6.9 MiB/s | 203.9 KiB |  00m00s
[ 3/11] cppcheck-0:2.14.2-1.fc41.x86_64 100% |  28.4 MiB/s |   2.6 MiB |  00m00s
[ 4/11] tinyxml2-0:9.0.0-4.fc40.x86_64  100% |   2.3 MiB/s |  42.2 KiB |  00m00s
[ 5/11] ShellCheck-0:0.10.0-1.fc41.x86_ 100% |  43.0 MiB/s |   5.0 MiB |  00m00s
[ 6/11] clang-resource-filesystem-0:18. 100% | 445.5 KiB/s |  15.1 KiB |  00m00s
[ 7/11] libedit-0:3.1-51.20240517cvs.fc 100% |   1.7 MiB/s | 104.9 KiB |  00m00s
[ 8/11] clang-libs-0:18.1.7-1.fc41.x86_ 100% |  77.8 MiB/s |  22.9 MiB |  00m00s
[ 9/11] llvm-libs-0:18.1.7-1.fc41.x86_6 100% |  60.8 MiB/s |  28.0 MiB |  00m00s
[10/11] libstdc++-devel-0:14.1.1-6.fc41 100% |  13.9 MiB/s |   2.7 MiB |  00m00s
[11/11] gcc-c++-0:14.1.1-6.fc41.x86_64  100% |  31.3 MiB/s |  14.2 MiB |  00m00s
--------------------------------------------------------------------------------
[11/11] Total                           100% | 110.3 MiB/s |  76.0 MiB |  00m01s
Running transaction
[ 1/13] Verify package files            100% |  44.0   B/s |  11.0   B |  00m00s
[ 2/13] Prepare transaction             100% | 354.0   B/s |  11.0   B |  00m00s
[ 3/13] Installing libstdc++-devel-0:14 100% | 225.4 MiB/s |  15.6 MiB |  00m00s
[ 4/13] Installing gcc-c++-0:14.1.1-6.f 100% | 363.4 MiB/s |  38.2 MiB |  00m00s
[ 5/13] Installing libedit-0:3.1-51.202 100% |  48.0 MiB/s | 245.6 KiB |  00m00s
[ 6/13] Installing llvm-libs-0:18.1.7-1 100% | 420.2 MiB/s | 113.5 MiB |  00m00s
[ 7/13] Installing clang-resource-files 100% | 391.6 KiB/s |   1.6 KiB |  00m00s
[ 8/13] Installing clang-libs-0:18.1.7- 100% | 429.6 MiB/s | 107.8 MiB |  00m00s
[ 9/13] Installing tinyxml2-0:9.0.0-4.f 100% |  34.2 MiB/s | 104.9 KiB |  00m00s
[10/13] Installing pcre-0:8.45-1.fc40.6 100% |  88.6 MiB/s | 544.1 KiB |  00m00s
[11/13] Installing cppcheck-0:2.14.2-1. 100% | 325.2 MiB/s |  10.1 MiB |  00m00s
[12/13] Installing clang-0:18.1.7-1.fc4 100% | 115.3 MiB/s | 590.4 KiB |  00m00s
warning: posix.fork(): .fork(), .exec(), .wait() and .redirect2null() are deprecated, use rpm.execute() instead
warning: posix.wait(): .fork(), .exec(), .wait() and .redirect2null() are deprecated, use rpm.execute() instead
warning: posix.exec(): .fork(), .exec(), .wait() and .redirect2null() are deprecated, use rpm.execute() instead
[13/13] Installing ShellCheck-0:0.10.0- 100% |  19.9 MiB/s |  33.9 MiB |  00m02s
>>> Running trigger-install scriptlet: glibc-common-0:2.39.9000-26.fc41.x86_64
>>> Stop trigger-install scriptlet: glibc-common-0:2.39.9000-26.fc41.x86_64

>>> 2024-07-03 16:13:24	"'/usr/bin/mock' '-r' 'fedora-41-x86_64' '--plugin-option=tmpfs:keep_mounted=True' '--config-opts=print_main_output=True' '--quiet' '--shell' 'rpm -qa' | sort -V > /tmp/csmock3_58cvwq/mod_wsgi-5.0.0-1.fc40/debug/rpm-list-mock.txt"

>>> 2024-07-03 16:13:25	"'/usr/bin/mock' '-r' 'fedora-41-x86_64' '--plugin-option=tmpfs:keep_mounted=True' '--config-opts=print_main_output=True' '--quiet' '--shell' 'rpm -qa --provides' | sort -V > /tmp/csmock3_58cvwq/rpm-list-mock-provides.txt"

>>> 2024-07-03 16:13:27	"/usr/bin/mock" "-r" "fedora-41-x86_64" "--plugin-option=tmpfs:keep_mounted=True" "--config-opts=print_main_output=True" "--quiet" "--copyin" "/tmp/csmock3_58cvwq/mod_wsgi-5.0.0-1.fc40.src.rpm" "/builddir/mod_wsgi-5.0.0-1.fc40.src.rpm"

>>> 2024-07-03 16:13:27	"/usr/bin/mock" "-r" "fedora-41-x86_64" "--plugin-option=tmpfs:keep_mounted=True" "--config-opts=print_main_output=True" "--quiet" "--chroot" "chown mockbuild -R /builddir"

>>> 2024-07-03 16:13:28	"/usr/bin/mock" "-r" "fedora-41-x86_64" "--plugin-option=tmpfs:keep_mounted=True" "--config-opts=print_main_output=True" "--quiet" "--chroot" "/bin/su mockbuild -l -c \"rpm -Uvh --nodeps '/builddir/mod_wsgi-5.0.0-1.fc40.src.rpm'\""
Updating / installing...
mod_wsgi-5.0.0-1.fc40                 ########################################

>>> 2024-07-03 16:13:29	"/usr/bin/mock" "-r" "fedora-41-x86_64" "--plugin-option=tmpfs:keep_mounted=True" "--config-opts=print_main_output=True" "--quiet" "--chroot" "/bin/su mockbuild -l -c \"rpmbuild -bs --nodeps /builddir/build/SPECS/mod_wsgi.spec '--define' '_unpackaged_files_terminate_build 0' '--define' 'apidocs 0' '--define' 'with_publican 0' '--without' 'docs' '--without' 'langpacks' && sh -c 'cd /builddir/build/SRPMS && eval mv -v *.src.rpm /builddir/mod_wsgi-5.0.0-1.fc40.src.rpm || :'\""
setting SOURCE_DATE_EPOCH=1706140800
Wrote: /builddir/build/SRPMS/mod_wsgi-5.0.0-1.fc41.src.rpm
renamed 'mod_wsgi-5.0.0-1.fc41.src.rpm' -> '/builddir/mod_wsgi-5.0.0-1.fc40.src.rpm'

>>> 2024-07-03 16:13:31	"/usr/bin/mock" "-r" "fedora-41-x86_64" "--plugin-option=tmpfs:keep_mounted=True" "--config-opts=print_main_output=True" "--quiet" "--disable-plugin=selinux" "--copyout" "/builddir/mod_wsgi-5.0.0-1.fc40.src.rpm" "/tmp/csmock3_58cvwq/mod_wsgi-5.0.0-1.fc40.src.rpm"

>>> 2024-07-03 16:13:32	"/usr/bin/mock" "-r" "fedora-41-x86_64" "--plugin-option=tmpfs:keep_mounted=True" "--config-opts=print_main_output=True" "--quiet" "--installdeps" "/tmp/csmock3_58cvwq/mod_wsgi-5.0.0-1.fc40.src.rpm"
Updating and loading repositories:
 fedora                                 100% |   1.3 MiB/s |  24.8 KiB |  00m00s
Repositories loaded.
Package "gcc-14.1.1-6.fc41.x86_64" is already installed.
Package "httpd-devel-2.4.59-2.fc41.x86_64" is already installed.
Package "make-1:4.4.1-6.fc40.x86_64" is already installed.
Package "python3-devel-3.13.0~b3-1.fc41.x86_64" is already installed.
Package "python3-setuptools-69.2.0-6.fc41.noarch" is already installed.
Package "python3-sphinx-1:7.2.6-8.fc41.noarch" is already installed.
Package "python3-sphinx_rtd_theme-2.0.0-4.fc41.noarch" is already installed.

Nothing to do.

>>> 2024-07-03 16:13:33	"/usr/bin/mock" "-r" "fedora-41-x86_64" "--plugin-option=tmpfs:keep_mounted=True" "--config-opts=print_main_output=True" "--quiet" "--install" "tar" "clang" "cppcheck" "gcc" "ShellCheck"
Updating and loading repositories:
 fedora                                 100% |   1.3 MiB/s |  24.8 KiB |  00m00s
Repositories loaded.
Package "tar-2:1.35-3.fc40.x86_64" is already installed.
Package "clang-18.1.7-1.fc41.x86_64" is already installed.
Package "cppcheck-2.14.2-1.fc41.x86_64" is already installed.
Package "gcc-14.1.1-6.fc41.x86_64" is already installed.
Package "ShellCheck-0.10.0-1.fc41.x86_64" is already installed.

Nothing to do.

>>> 2024-07-03 16:13:35	"'/usr/bin/mock' '-r' 'fedora-41-x86_64' '--plugin-option=tmpfs:keep_mounted=True' '--config-opts=print_main_output=True' '--quiet' '--shell' 'rpm -qa' | sort -V > /tmp/csmock3_58cvwq/mod_wsgi-5.0.0-1.fc40/debug/rpm-list-mock.txt"

>>> 2024-07-03 16:13:36	"'/usr/bin/mock' '-r' 'fedora-41-x86_64' '--plugin-option=tmpfs:keep_mounted=True' '--config-opts=print_main_output=True' '--quiet' '--shell' 'rpm -qa --provides' | sort -V > /tmp/csmock3_58cvwq/rpm-list-mock-provides.txt"

>>> 2024-07-03 16:13:37	"/usr/bin/mock" "-r" "fedora-41-x86_64" "--plugin-option=tmpfs:keep_mounted=True" "--config-opts=print_main_output=True" "--quiet" "--install" "csdiff"
Updating and loading repositories:
 fedora                                 100% |   1.1 MiB/s |  24.8 KiB |  00m00s
Repositories loaded.
Package                Arch   Version       Repository      Size
Installing:
 csdiff                x86_64 3.4.0-1.fc41  fedora       3.6 MiB
Installing dependencies:
 boost-atomic          x86_64 1.83.0-7.fc41 fedora      21.0 KiB
 boost-filesystem      x86_64 1.83.0-7.fc41 fedora     147.6 KiB
 boost-program-options x86_64 1.83.0-7.fc41 fedora     272.7 KiB
 boost-system          x86_64 1.83.0-7.fc41 fedora      16.3 KiB

Transaction Summary:
 Installing:        5 packages

Total size of inbound packages is 1 MiB. Need to download 1 MiB.
After this operation 4 MiB will be used (install 4 MiB, remove 0 B).
[1/5] boost-filesystem-0:1.83.0-7.fc41. 100% |   1.9 MiB/s |  69.1 KiB |  00m00s
[2/5] boost-program-options-0:1.83.0-7. 100% |   2.4 MiB/s | 108.7 KiB |  00m00s
[3/5] csdiff-0:3.4.0-1.fc41.x86_64      100% |  13.1 MiB/s | 925.5 KiB |  00m00s
[4/5] boost-system-0:1.83.0-7.fc41.x86_ 100% | 583.8 KiB/s |  15.2 KiB |  00m00s
[5/5] boost-atomic-0:1.83.0-7.fc41.x86_ 100% | 553.0 KiB/s |  19.4 KiB |  00m00s
--------------------------------------------------------------------------------
[5/5] Total                             100% |  12.3 MiB/s |   1.1 MiB |  00m00s
Running transaction
[1/7] Verify package files              100% |   1.2 KiB/s |   5.0   B |  00m00s
[2/7] Prepare transaction               100% | 238.0   B/s |   5.0   B |  00m00s
[3/7] Installing boost-system-0:1.83.0- 100% |   4.2 MiB/s |  17.3 KiB |  00m00s
[4/7] Installing boost-atomic-0:1.83.0- 100% |   7.2 MiB/s |  22.0 KiB |  00m00s
[5/7] Installing boost-filesystem-0:1.8 100% |  48.4 MiB/s | 148.6 KiB |  00m00s
[6/7] Installing boost-program-options- 100% |  66.8 MiB/s | 273.8 KiB |  00m00s
warning: posix.fork(): .fork(), .exec(), .wait() and .redirect2null() are deprecated, use rpm.execute() instead
warning: posix.wait(): .fork(), .exec(), .wait() and .redirect2null() are deprecated, use rpm.execute() instead
warning: posix.exec(): .fork(), .exec(), .wait() and .redirect2null() are deprecated, use rpm.execute() instead
[7/7] Installing csdiff-0:3.4.0-1.fc41. 100% |  46.2 MiB/s |   3.7 MiB |  00m00s
>>> Running trigger-install scriptlet: glibc-common-0:2.39.9000-26.fc41.x86_64
>>> Stop trigger-install scriptlet: glibc-common-0:2.39.9000-26.fc41.x86_64

>>> 2024-07-03 16:13:38	"'/usr/bin/mock' '-r' 'fedora-41-x86_64' '--plugin-option=tmpfs:keep_mounted=True' '--config-opts=print_main_output=True' '--quiet' '--shell' 'rpm -qa' | sort -V > /tmp/csmock3_58cvwq/mod_wsgi-5.0.0-1.fc40/debug/rpm-list-mock.txt"

>>> 2024-07-03 16:13:40	"'/usr/bin/mock' '-r' 'fedora-41-x86_64' '--plugin-option=tmpfs:keep_mounted=True' '--config-opts=print_main_output=True' '--quiet' '--shell' 'rpm -qa --provides' | sort -V > /tmp/csmock3_58cvwq/rpm-list-mock-provides.txt"

>>> 2024-07-03 16:13:41	"tar -cP '/usr/share/csmock/scripts' '/usr/bin/cswrap' '/usr/lib64/cswrap' '/usr/bin/csclng' '/usr/lib64/csclng' '/usr/bin/csclng++' '/usr/bin/cscppc' '/usr/lib64/cscppc' '/usr/share/cscppc' '/usr/bin/csgcca' '/usr/lib64/csgcca' '/tmp/csmock3_58cvwq/mod_wsgi-5.0.0-1.fc40.src.rpm' | '/usr/bin/mock' '-r' 'fedora-41-x86_64' '--plugin-option=tmpfs:keep_mounted=True' '--config-opts=print_main_output=True' '--quiet' '--shell' 'tar -xC/'"
tar: Removing leading `/' from member names

scan.ini: analyzer-version-clang = 18.1.7
scan.ini: analyzer-version-cppcheck = 2.14.2
scan.ini: analyzer-version-gcc = 14.1.1
>>> 2024-07-03 16:13:43	"/usr/bin/mock" "-r" "fedora-41-x86_64" "--plugin-option=tmpfs:keep_mounted=True" "--config-opts=print_main_output=True" "--quiet" "--chroot" "/bin/su mockbuild -l -c \"echo 'int main() {}' | gcc -xc - -c -o /dev/null -fanalyzer -fdiagnostics-path-format=separate-events\""

scan.ini: analyzer-version-gcc-analyzer = 14.1.1
scan.ini: analyzer-version-shellcheck = 0.10.0
>>> 2024-07-03 16:13:45	"/usr/bin/mock" "-r" "fedora-41-x86_64" "--plugin-option=tmpfs:keep_mounted=True" "--config-opts=print_main_output=True" "--quiet" "--chroot" "rpm -Uvh --nodeps '/tmp/csmock3_58cvwq/mod_wsgi-5.0.0-1.fc40.src.rpm'"
Updating / installing...
mod_wsgi-5.0.0-1.fc41                 ########################################

>>> 2024-07-03 16:13:46	"/usr/bin/mock" "-r" "fedora-41-x86_64" "--plugin-option=tmpfs:keep_mounted=True" "--config-opts=print_main_output=True" "--quiet" "--chroot" "chmod -R +r /builddir"

>>> 2024-07-03 16:13:47	"/usr/bin/mock" "-r" "fedora-41-x86_64" "--plugin-option=tmpfs:keep_mounted=True" "--config-opts=print_main_output=True" "--quiet" "--shell" "for i in /usr/share/csmock/scripts/chroot-fixups/*; do test -x \$i && echo RUN: \$i >&2 && \$i; done"
RUN: /usr/share/csmock/scripts/chroot-fixups/gdk-pixbuf2-triggers.sh
RUN: /usr/share/csmock/scripts/chroot-fixups/glib2-triggers.sh
RUN: /usr/share/csmock/scripts/chroot-fixups/kpathsea-texhash.sh
RUN: /usr/share/csmock/scripts/chroot-fixups/openssl-public-header-files.sh
RUN: /usr/share/csmock/scripts/chroot-fixups/qt5-core-abi.sh
RUN: /usr/share/csmock/scripts/chroot-fixups/rpm-build-scripts.sh
+ sed -e s/fail=1/fail=0/ -i /usr/lib/rpm/redhat/brp-mangle-shebangs
'/usr/lib/rpm/brp-strip-static-archive' -> '/bin/true'
RUN: /usr/share/csmock/scripts/chroot-fixups/rpm-macros.sh
+ sed -e 's|> */dev/stderr|>\&2|' -i /usr/lib/rpm/macros.d/macros.pyproject
RUN: /usr/share/csmock/scripts/chroot-fixups/rpm-python-extras.sh
+ sed -e 's|print(.*PYTHON_EXTRAS_NOT_FOUND_ERROR.*) *$|continue|' -i /usr/lib/rpm/pythondistdeps.py
RUN: /usr/share/csmock/scripts/chroot-fixups/shared-mime-info-triggers.sh
RUN: /usr/share/csmock/scripts/chroot-fixups/symbiotic-timeout.sh

>>> 2024-07-03 16:13:48	"/usr/bin/mock" "-r" "fedora-41-x86_64" "--plugin-option=tmpfs:keep_mounted=True" "--config-opts=print_main_output=True" "--chroot" "/bin/su mockbuild -l -c \"rpmbuild -bp --nodeps /builddir/build/SPECS/mod_wsgi.spec '--define' '_unpackaged_files_terminate_build 0' '--define' 'apidocs 0' '--define' 'with_publican 0' '--without' 'docs' '--without' 'langpacks'\""
INFO: mock.py version 5.6 starting (python version = 3.9.19, NVR = mock-5.6-1.el9), args: /usr/libexec/mock/mock -r fedora-41-x86_64 --plugin-option=tmpfs:keep_mounted=True --config-opts=print_main_output=True --chroot '/bin/su mockbuild -l -c "rpmbuild -bp --nodeps /builddir/build/SPECS/mod_wsgi.spec '"'"'--define'"'"' '"'"'_unpackaged_files_terminate_build 0'"'"' '"'"'--define'"'"' '"'"'apidocs 0'"'"' '"'"'--define'"'"' '"'"'with_publican 0'"'"' '"'"'--without'"'"' '"'"'docs'"'"' '"'"'--without'"'"' '"'"'langpacks'"'"'"'
Start(bootstrap): init plugins
INFO: selinux enabled
Finish(bootstrap): init plugins
Start: init plugins
INFO: selinux enabled
Finish: init plugins
INFO: Signal handler active
Start: run
Mock Version: 5.6
INFO: Mock Version: 5.6
Start(bootstrap): chroot init
INFO: calling preinit hooks
INFO: enabled root cache
INFO: enabled package manager cache
Start(bootstrap): cleaning package manager metadata
Finish(bootstrap): cleaning package manager metadata
INFO: Package manager dnf5 detected and used (fallback)
Finish(bootstrap): chroot init
Start: chroot init
INFO: calling preinit hooks
INFO: enabled root cache
INFO: enabled package manager cache
Start: cleaning package manager metadata
Finish: cleaning package manager metadata
INFO: enabled HW Info plugin
INFO: Package manager dnf5 detected and used (direct choice)
Finish: chroot init
INFO: Running in chroot: ['/bin/su mockbuild -l -c "rpmbuild -bp --nodeps /builddir/build/SPECS/mod_wsgi.spec \'--define\' \'_unpackaged_files_terminate_build 0\' \'--define\' \'apidocs 0\' \'--define\' \'with_publican 0\' \'--without\' \'docs\' \'--without\' \'langpacks\'"']
Start: chroot ['/bin/su mockbuild -l -c "rpmbuild -bp --nodeps /builddir/build/SPECS/mod_wsgi.spec \'--define\' \'_unpackaged_files_terminate_build 0\' \'--define\' \'apidocs 0\' \'--define\' \'with_publican 0\' \'--without\' \'docs\' \'--without\' \'langpacks\'"']
setting SOURCE_DATE_EPOCH=1706140800
Executing(%mkbuilddir): /bin/sh -e /var/tmp/rpm-tmp.YkJSty
+ umask 022
+ cd /builddir/build/BUILD/mod_wsgi-5.0.0-build
+ test -d /builddir/build/BUILD/mod_wsgi-5.0.0-build
+ /usr/bin/chmod -Rf a+rX,u+w,g-w,o-w /builddir/build/BUILD/mod_wsgi-5.0.0-build
+ /usr/bin/rm -rf /builddir/build/BUILD/mod_wsgi-5.0.0-build
+ /usr/bin/mkdir -p /builddir/build/BUILD/mod_wsgi-5.0.0-build
+ /usr/bin/mkdir -p /builddir/build/BUILD/mod_wsgi-5.0.0-build/SPECPARTS
+ RPM_EC=0
++ jobs -p
+ exit 0
Executing(%prep): /bin/sh -e /var/tmp/rpm-tmp.xkVuyy
+ umask 022
+ cd /builddir/build/BUILD/mod_wsgi-5.0.0-build
+ cd /builddir/build/BUILD/mod_wsgi-5.0.0-build
+ rm -rf mod_wsgi-5.0.0
+ /usr/lib/rpm/rpmuncompress -x /builddir/build/SOURCES/mod_wsgi-5.0.0.tar.gz
+ STATUS=0
+ '[' 0 -ne 0 ']'
+ cd mod_wsgi-5.0.0
+ /usr/bin/chmod -Rf a+rX,u+w,g-w,o-w .
+ /usr/lib/rpm/rpmuncompress /builddir/build/SOURCES/mod_wsgi-4.5.20-exports.patch
+ /usr/bin/patch -p1 -s --fuzz=0 --no-backup-if-mismatch -f
+ : Python2=0 Python3=1
+ RPM_EC=0
++ jobs -p
+ exit 0
Finish: chroot ['/bin/su mockbuild -l -c "rpmbuild -bp --nodeps /builddir/build/SPECS/mod_wsgi.spec \'--define\' \'_unpackaged_files_terminate_build 0\' \'--define\' \'apidocs 0\' \'--define\' \'with_publican 0\' \'--without\' \'docs\' \'--without\' \'langpacks\'"']
Finish: run

>>> 2024-07-03 16:13:49	"/usr/bin/mock" "-r" "fedora-41-x86_64" "--plugin-option=tmpfs:keep_mounted=True" "--config-opts=print_main_output=True" "--quiet" "--chroot" "chmod -R +r /builddir/build"

>>> 2024-07-03 16:13:50	"/usr/bin/mock" "-r" "fedora-41-x86_64" "--plugin-option=tmpfs:keep_mounted=True" "--config-opts=print_main_output=True" "--chroot" "/bin/su mockbuild -l -c \"PATH=/usr/lib64/cscppc:/usr/lib64/csclng:/usr/lib64/csgcca:/usr/lib64/cswrap:\\\$PATH CSWRAP_CAP_FILE=\\\$'/builddir/cswrap-capture.err' CSWRAP_TIMEOUT=\\\$'30' CSWRAP_TIMEOUT_FOR=\\\$'::clang:clang++:cppcheck:gcc' CSWRAP_ADD_CFLAGS=\\\$'-Wno-unknown-pragmas' CSWRAP_DEL_CFLAGS=\\\$'-Werror*:-fdiagnostics-color*:-no-canonical-prefixes:-Wno-error=deprecated-register' CSWRAP_ADD_CXXFLAGS=\\\$'' CSWRAP_DEL_CXXFLAGS=\\\$'-Werror*:-fdiagnostics-color*:-no-canonical-prefixes:-Wno-error=deprecated-register' sh -c \\\"rpmbuild -bc --nodeps --short-circuit /builddir/build/SPECS/mod_wsgi.spec '--define' '_unpackaged_files_terminate_build 0' '--define' 'apidocs 0' '--define' 'with_publican 0' '--without' 'docs' '--without' 'langpacks'\\\"\""
INFO: mock.py version 5.6 starting (python version = 3.9.19, NVR = mock-5.6-1.el9), args: /usr/libexec/mock/mock -r fedora-41-x86_64 --plugin-option=tmpfs:keep_mounted=True --config-opts=print_main_output=True --chroot '/bin/su mockbuild -l -c "PATH=/usr/lib64/cscppc:/usr/lib64/csclng:/usr/lib64/csgcca:/usr/lib64/cswrap:\$PATH CSWRAP_CAP_FILE=\$'"'"'/builddir/cswrap-capture.err'"'"' CSWRAP_TIMEOUT=\$'"'"'30'"'"' CSWRAP_TIMEOUT_FOR=\$'"'"'::clang:clang++:cppcheck:gcc'"'"' CSWRAP_ADD_CFLAGS=\$'"'"'-Wno-unknown-pragmas'"'"' CSWRAP_DEL_CFLAGS=\$'"'"'-Werror*:-fdiagnostics-color*:-no-canonical-prefixes:-Wno-error=deprecated-register'"'"' CSWRAP_ADD_CXXFLAGS=\$'"'"''"'"' CSWRAP_DEL_CXXFLAGS=\$'"'"'-Werror*:-fdiagnostics-color*:-no-canonical-prefixes:-Wno-error=deprecated-register'"'"' sh -c \"rpmbuild -bc --nodeps --short-circuit /builddir/build/SPECS/mod_wsgi.spec '"'"'--define'"'"' '"'"'_unpackaged_files_terminate_build 0'"'"' '"'"'--define'"'"' '"'"'apidocs 0'"'"' '"'"'--define'"'"' '"'"'with_publican 0'"'"' '"'"'--without'"'"' '"'"'docs'"'"' '"'"'--without'"'"' '"'"'langpacks'"'"'\""'
Start(bootstrap): init plugins
INFO: selinux enabled
Finish(bootstrap): init plugins
Start: init plugins
INFO: selinux enabled
Finish: init plugins
INFO: Signal handler active
Start: run
Mock Version: 5.6
INFO: Mock Version: 5.6
Start(bootstrap): chroot init
INFO: calling preinit hooks
INFO: enabled root cache
INFO: enabled package manager cache
Start(bootstrap): cleaning package manager metadata
Finish(bootstrap): cleaning package manager metadata
INFO: Package manager dnf5 detected and used (fallback)
Finish(bootstrap): chroot init
Start: chroot init
INFO: calling preinit hooks
INFO: enabled root cache
INFO: enabled package manager cache
Start: cleaning package manager metadata
Finish: cleaning package manager metadata
INFO: enabled HW Info plugin
INFO: Package manager dnf5 detected and used (direct choice)
Finish: chroot init
INFO: Running in chroot: ['/bin/su mockbuild -l -c "PATH=/usr/lib64/cscppc:/usr/lib64/csclng:/usr/lib64/csgcca:/usr/lib64/cswrap:\\$PATH CSWRAP_CAP_FILE=\\$\'/builddir/cswrap-capture.err\' CSWRAP_TIMEOUT=\\$\'30\' CSWRAP_TIMEOUT_FOR=\\$\'::clang:clang++:cppcheck:gcc\' CSWRAP_ADD_CFLAGS=\\$\'-Wno-unknown-pragmas\' CSWRAP_DEL_CFLAGS=\\$\'-Werror*:-fdiagnostics-color*:-no-canonical-prefixes:-Wno-error=deprecated-register\' CSWRAP_ADD_CXXFLAGS=\\$\'\' CSWRAP_DEL_CXXFLAGS=\\$\'-Werror*:-fdiagnostics-color*:-no-canonical-prefixes:-Wno-error=deprecated-register\' sh -c \\"rpmbuild -bc --nodeps --short-circuit /builddir/build/SPECS/mod_wsgi.spec \'--define\' \'_unpackaged_files_terminate_build 0\' \'--define\' \'apidocs 0\' \'--define\' \'with_publican 0\' \'--without\' \'docs\' \'--without\' \'langpacks\'\\""']
Start: chroot ['/bin/su mockbuild -l -c "PATH=/usr/lib64/cscppc:/usr/lib64/csclng:/usr/lib64/csgcca:/usr/lib64/cswrap:\\$PATH CSWRAP_CAP_FILE=\\$\'/builddir/cswrap-capture.err\' CSWRAP_TIMEOUT=\\$\'30\' CSWRAP_TIMEOUT_FOR=\\$\'::clang:clang++:cppcheck:gcc\' CSWRAP_ADD_CFLAGS=\\$\'-Wno-unknown-pragmas\' CSWRAP_DEL_CFLAGS=\\$\'-Werror*:-fdiagnostics-color*:-no-canonical-prefixes:-Wno-error=deprecated-register\' CSWRAP_ADD_CXXFLAGS=\\$\'\' CSWRAP_DEL_CXXFLAGS=\\$\'-Werror*:-fdiagnostics-color*:-no-canonical-prefixes:-Wno-error=deprecated-register\' sh -c \\"rpmbuild -bc --nodeps --short-circuit /builddir/build/SPECS/mod_wsgi.spec \'--define\' \'_unpackaged_files_terminate_build 0\' \'--define\' \'apidocs 0\' \'--define\' \'with_publican 0\' \'--without\' \'docs\' \'--without\' \'langpacks\'\\""']
setting SOURCE_DATE_EPOCH=1706140800
Executing(%build): /bin/sh -e /var/tmp/rpm-tmp.7ETMHl
+ umask 022
+ cd /builddir/build/BUILD/mod_wsgi-5.0.0-build
+ CFLAGS='-O2 -flto=auto -ffat-lto-objects -fexceptions -g -grecord-gcc-switches -pipe -Wall -Werror=format-security -Wp,-U_FORTIFY_SOURCE,-D_FORTIFY_SOURCE=3 -Wp,-D_GLIBCXX_ASSERTIONS -specs=/usr/lib/rpm/redhat/redhat-hardened-cc1 -fstack-protector-strong -specs=/usr/lib/rpm/redhat/redhat-annobin-cc1  -m64 -march=x86-64 -mtune=generic -fasynchronous-unwind-tables -fstack-clash-protection -fcf-protection -mtls-dialect=gnu2 -fno-omit-frame-pointer -mno-omit-leaf-frame-pointer '
+ export CFLAGS
+ CXXFLAGS='-O2 -flto=auto -ffat-lto-objects -fexceptions -g -grecord-gcc-switches -pipe -Wall -Werror=format-security -Wp,-U_FORTIFY_SOURCE,-D_FORTIFY_SOURCE=3 -Wp,-D_GLIBCXX_ASSERTIONS -specs=/usr/lib/rpm/redhat/redhat-hardened-cc1 -fstack-protector-strong -specs=/usr/lib/rpm/redhat/redhat-annobin-cc1  -m64 -march=x86-64 -mtune=generic -fasynchronous-unwind-tables -fstack-clash-protection -fcf-protection -mtls-dialect=gnu2 -fno-omit-frame-pointer -mno-omit-leaf-frame-pointer '
+ export CXXFLAGS
+ FFLAGS='-O2 -flto=auto -ffat-lto-objects -fexceptions -g -grecord-gcc-switches -pipe -Wall -Wp,-U_FORTIFY_SOURCE,-D_FORTIFY_SOURCE=3 -Wp,-D_GLIBCXX_ASSERTIONS -specs=/usr/lib/rpm/redhat/redhat-hardened-cc1 -fstack-protector-strong -specs=/usr/lib/rpm/redhat/redhat-annobin-cc1  -m64 -march=x86-64 -mtune=generic -fasynchronous-unwind-tables -fstack-clash-protection -fcf-protection -mtls-dialect=gnu2 -fno-omit-frame-pointer -mno-omit-leaf-frame-pointer -I/usr/lib64/gfortran/modules '
+ export FFLAGS
+ FCFLAGS='-O2 -flto=auto -ffat-lto-objects -fexceptions -g -grecord-gcc-switches -pipe -Wall -Wp,-U_FORTIFY_SOURCE,-D_FORTIFY_SOURCE=3 -Wp,-D_GLIBCXX_ASSERTIONS -specs=/usr/lib/rpm/redhat/redhat-hardened-cc1 -fstack-protector-strong -specs=/usr/lib/rpm/redhat/redhat-annobin-cc1  -m64 -march=x86-64 -mtune=generic -fasynchronous-unwind-tables -fstack-clash-protection -fcf-protection -mtls-dialect=gnu2 -fno-omit-frame-pointer -mno-omit-leaf-frame-pointer -I/usr/lib64/gfortran/modules '
+ export FCFLAGS
+ VALAFLAGS=-g
+ export VALAFLAGS
+ RUSTFLAGS='-Copt-level=3 -Cdebuginfo=2 -Ccodegen-units=1 -Cstrip=none -Cforce-frame-pointers=yes -Clink-arg=-specs=/usr/lib/rpm/redhat/redhat-package-notes --cap-lints=warn'
+ export RUSTFLAGS
+ LDFLAGS='-Wl,-z,relro -Wl,--as-needed  -Wl,-z,pack-relative-relocs -Wl,-z,now -specs=/usr/lib/rpm/redhat/redhat-hardened-ld -specs=/usr/lib/rpm/redhat/redhat-annobin-cc1  -Wl,--build-id=sha1 -specs=/usr/lib/rpm/redhat/redhat-package-notes '
+ export LDFLAGS
+ LT_SYS_LIBRARY_PATH=/usr/lib64:
+ export LT_SYS_LIBRARY_PATH
+ CC=gcc
+ export CC
+ CXX=g++
+ export CXX
+ cd mod_wsgi-5.0.0
+ /usr/bin/make -O -j8 V=1 VERBOSE=1 -C docs html
make: Entering directory '/builddir/build/BUILD/mod_wsgi-5.0.0-build/mod_wsgi-5.0.0/docs'
sphinx-build -b html -d _build/doctrees   . _build/html
Running Sphinx v7.2.6
building [mo]: targets for 0 po files that are out of date
writing output... 
building [html]: targets for 167 source files that are out of date
updating environment: [new config] 167 added, 0 changed, 0 removed
reading sources... [  1%] configuration
reading sources... [  1%] configuration-directives/WSGIAcceptMutex
reading sources... [  2%] configuration-directives/WSGIAccessScript
reading sources... [  2%] configuration-directives/WSGIApplicationGroup
reading sources... [  3%] configuration-directives/WSGIAuthGroupScript
reading sources... [  4%] configuration-directives/WSGIAuthUserScript
reading sources... [  4%] configuration-directives/WSGICallableObject
reading sources... [  5%] configuration-directives/WSGICaseSensitivity
reading sources... [  5%] configuration-directives/WSGIChunkedRequest
reading sources... [  6%] configuration-directives/WSGIDaemonProcess
reading sources... [  7%] configuration-directives/WSGIImportScript
reading sources... [  7%] configuration-directives/WSGILazyInitialization
reading sources... [  8%] configuration-directives/WSGIPassAuthorization
reading sources... [  8%] configuration-directives/WSGIProcessGroup
reading sources... [  9%] configuration-directives/WSGIPythonEggs
reading sources... [ 10%] configuration-directives/WSGIPythonHome
reading sources... [ 10%] configuration-directives/WSGIPythonOptimize
reading sources... [ 11%] configuration-directives/WSGIPythonPath
reading sources... [ 11%] configuration-directives/WSGIRestrictEmbedded
reading sources... [ 12%] configuration-directives/WSGIRestrictProcess
reading sources... [ 13%] configuration-directives/WSGIRestrictSignal
reading sources... [ 13%] configuration-directives/WSGIRestrictStdin
reading sources... [ 14%] configuration-directives/WSGIRestrictStdout
reading sources... [ 14%] configuration-directives/WSGIScriptAlias
reading sources... [ 15%] configuration-directives/WSGIScriptAliasMatch
reading sources... [ 16%] configuration-directives/WSGIScriptReloading
reading sources... [ 16%] configuration-directives/WSGISocketPrefix
reading sources... [ 17%] configuration-directives/WSGITrustedProxies
reading sources... [ 17%] configuration-directives/WSGITrustedProxyHeaders
reading sources... [ 18%] contributing
reading sources... [ 19%] finding-help
reading sources... [ 19%] getting-started
reading sources... [ 20%] index
reading sources... [ 20%] installation
reading sources... [ 21%] project-status
reading sources... [ 22%] release-notes
reading sources... [ 22%] release-notes/version-1.0
reading sources... [ 23%] release-notes/version-1.1
reading sources... [ 23%] release-notes/version-1.2
reading sources... [ 24%] release-notes/version-1.3
reading sources... [ 25%] release-notes/version-1.4
reading sources... [ 25%] release-notes/version-1.5
reading sources... [ 26%] release-notes/version-1.6
reading sources... [ 26%] release-notes/version-2.0
reading sources... [ 27%] release-notes/version-2.1
reading sources... [ 28%] release-notes/version-2.2
reading sources... [ 28%] release-notes/version-2.3
reading sources... [ 29%] release-notes/version-2.4
reading sources... [ 29%] release-notes/version-2.5
reading sources... [ 30%] release-notes/version-2.6
reading sources... [ 31%] release-notes/version-2.7
reading sources... [ 31%] release-notes/version-2.8
reading sources... [ 32%] release-notes/version-3.0
reading sources... [ 32%] release-notes/version-3.1
reading sources... [ 33%] release-notes/version-3.2
reading sources... [ 34%] release-notes/version-3.3
reading sources... [ 34%] release-notes/version-3.4
reading sources... [ 35%] release-notes/version-3.5
reading sources... [ 35%] release-notes/version-4.0
reading sources... [ 36%] release-notes/version-4.1.0
reading sources... [ 37%] release-notes/version-4.1.1
reading sources... [ 37%] release-notes/version-4.1.2
reading sources... [ 38%] release-notes/version-4.1.3
reading sources... [ 38%] release-notes/version-4.2.0
reading sources... [ 39%] release-notes/version-4.2.1
reading sources... [ 40%] release-notes/version-4.2.2
reading sources... [ 40%] release-notes/version-4.2.3
reading sources... [ 41%] release-notes/version-4.2.4
reading sources... [ 41%] release-notes/version-4.2.5
reading sources... [ 42%] release-notes/version-4.2.6
reading sources... [ 43%] release-notes/version-4.2.7
reading sources... [ 43%] release-notes/version-4.2.8
reading sources... [ 44%] release-notes/version-4.3.0
reading sources... [ 44%] release-notes/version-4.3.1
reading sources... [ 45%] release-notes/version-4.3.2
reading sources... [ 46%] release-notes/version-4.4.0
reading sources... [ 46%] release-notes/version-4.4.1
reading sources... [ 47%] release-notes/version-4.4.10
reading sources... [ 47%] release-notes/version-4.4.11
reading sources... [ 48%] release-notes/version-4.4.12
reading sources... [ 49%] release-notes/version-4.4.13
reading sources... [ 49%] release-notes/version-4.4.14
reading sources... [ 50%] release-notes/version-4.4.15
reading sources... [ 50%] release-notes/version-4.4.16
reading sources... [ 51%] release-notes/version-4.4.17
reading sources... [ 51%] release-notes/version-4.4.18
reading sources... [ 52%] release-notes/version-4.4.19
reading sources... [ 53%] release-notes/version-4.4.2
reading sources... [ 53%] release-notes/version-4.4.20
reading sources... [ 54%] release-notes/version-4.4.21
reading sources... [ 54%] release-notes/version-4.4.22
reading sources... [ 55%] release-notes/version-4.4.23
reading sources... [ 56%] release-notes/version-4.4.3
reading sources... [ 56%] release-notes/version-4.4.4
reading sources... [ 57%] release-notes/version-4.4.5
reading sources... [ 57%] release-notes/version-4.4.6
reading sources... [ 58%] release-notes/version-4.4.7
reading sources... [ 59%] release-notes/version-4.4.8
reading sources... [ 59%] release-notes/version-4.4.9
reading sources... [ 60%] release-notes/version-4.5.0
reading sources... [ 60%] release-notes/version-4.5.1
reading sources... [ 61%] release-notes/version-4.5.10
reading sources... [ 62%] release-notes/version-4.5.11
reading sources... [ 62%] release-notes/version-4.5.12
reading sources... [ 63%] release-notes/version-4.5.13
reading sources... [ 63%] release-notes/version-4.5.14
reading sources... [ 64%] release-notes/version-4.5.15
reading sources... [ 65%] release-notes/version-4.5.16
reading sources... [ 65%] release-notes/version-4.5.17
reading sources... [ 66%] release-notes/version-4.5.18
reading sources... [ 66%] release-notes/version-4.5.19
reading sources... [ 67%] release-notes/version-4.5.2
reading sources... [ 68%] release-notes/version-4.5.20
reading sources... [ 68%] release-notes/version-4.5.21
reading sources... [ 69%] release-notes/version-4.5.22
reading sources... [ 69%] release-notes/version-4.5.23
reading sources... [ 70%] release-notes/version-4.5.24
reading sources... [ 71%] release-notes/version-4.5.3
reading sources... [ 71%] release-notes/version-4.5.4
reading sources... [ 72%] release-notes/version-4.5.5
reading sources... [ 72%] release-notes/version-4.5.6
reading sources... [ 73%] release-notes/version-4.5.7
reading sources... [ 74%] release-notes/version-4.5.8
reading sources... [ 74%] release-notes/version-4.5.9
reading sources... [ 75%] release-notes/version-4.6.0
reading sources... [ 75%] release-notes/version-4.6.1
reading sources... [ 76%] release-notes/version-4.6.2
reading sources... [ 77%] release-notes/version-4.6.3
reading sources... [ 77%] release-notes/version-4.6.4
reading sources... [ 78%] release-notes/version-4.6.5
reading sources... [ 78%] release-notes/version-4.6.6
reading sources... [ 79%] release-notes/version-4.6.7
reading sources... [ 80%] release-notes/version-4.6.8
reading sources... [ 80%] release-notes/version-4.7.0
reading sources... [ 81%] release-notes/version-4.7.1
reading sources... [ 81%] release-notes/version-4.8.0
reading sources... [ 82%] release-notes/version-4.9.0
reading sources... [ 83%] release-notes/version-4.9.1
reading sources... [ 83%] release-notes/version-4.9.2
reading sources... [ 84%] release-notes/version-4.9.3
reading sources... [ 84%] release-notes/version-4.9.4
reading sources... [ 85%] release-notes/version-5.0.0
reading sources... [ 86%] reporting-bugs
reading sources... [ 86%] requirements
reading sources... [ 87%] security-issues
reading sources... [ 87%] source-code
reading sources... [ 88%] troubleshooting
reading sources... [ 89%] user-guides
reading sources... [ 89%] user-guides/access-control-mechanisms
reading sources... [ 90%] user-guides/application-issues
reading sources... [ 90%] user-guides/assorted-tips-and-tricks
reading sources... [ 91%] user-guides/checking-your-installation
reading sources... [ 92%] user-guides/configuration-guidelines
reading sources... [ 92%] user-guides/configuration-issues
reading sources... [ 93%] user-guides/debugging-techniques
reading sources... [ 93%] user-guides/file-wrapper-extension
reading sources... [ 94%] user-guides/frequently-asked-questions
reading sources... [ 95%] user-guides/installation-issues
reading sources... [ 95%] user-guides/installation-on-macosx
reading sources... [ 96%] user-guides/issues-with-expat-library
reading sources... [ 96%] user-guides/issues-with-pickle-module
reading sources... [ 97%] user-guides/processes-and-threading
reading sources... [ 98%] user-guides/quick-configuration-guide
reading sources... [ 98%] user-guides/quick-installation-guide
reading sources... [ 99%] user-guides/registering-cleanup-code
reading sources... [ 99%] user-guides/reloading-source-code
reading sources... [100%] user-guides/virtual-environments
looking for now-outdated files... none found
pickling environment... done
checking consistency... done
preparing documents... done
copying assets... copying static files... done
copying extra files... done
done
writing output... [  1%] configuration
writing output... [  1%] configuration-directives/WSGIAcceptMutex
writing output... [  2%] configuration-directives/WSGIAccessScript
writing output... [  2%] configuration-directives/WSGIApplicationGroup
writing output... [  3%] configuration-directives/WSGIAuthGroupScript
writing output... [  4%] configuration-directives/WSGIAuthUserScript
writing output... [  4%] configuration-directives/WSGICallableObject
writing output... [  5%] configuration-directives/WSGICaseSensitivity
writing output... [  5%] configuration-directives/WSGIChunkedRequest
writing output... [  6%] configuration-directives/WSGIDaemonProcess
writing output... [  7%] configuration-directives/WSGIImportScript
writing output... [  7%] configuration-directives/WSGILazyInitialization
writing output... [  8%] configuration-directives/WSGIPassAuthorization
writing output... [  8%] configuration-directives/WSGIProcessGroup
writing output... [  9%] configuration-directives/WSGIPythonEggs
writing output... [ 10%] configuration-directives/WSGIPythonHome
writing output... [ 10%] configuration-directives/WSGIPythonOptimize
writing output... [ 11%] configuration-directives/WSGIPythonPath
writing output... [ 11%] configuration-directives/WSGIRestrictEmbedded
writing output... [ 12%] configuration-directives/WSGIRestrictProcess
writing output... [ 13%] configuration-directives/WSGIRestrictSignal
writing output... [ 13%] configuration-directives/WSGIRestrictStdin
writing output... [ 14%] configuration-directives/WSGIRestrictStdout
writing output... [ 14%] configuration-directives/WSGIScriptAlias
writing output... [ 15%] configuration-directives/WSGIScriptAliasMatch
writing output... [ 16%] configuration-directives/WSGIScriptReloading
writing output... [ 16%] configuration-directives/WSGISocketPrefix
writing output... [ 17%] configuration-directives/WSGITrustedProxies
writing output... [ 17%] configuration-directives/WSGITrustedProxyHeaders
writing output... [ 18%] contributing
writing output... [ 19%] finding-help
writing output... [ 19%] getting-started
writing output... [ 20%] index
writing output... [ 20%] installation
writing output... [ 21%] project-status
writing output... [ 22%] release-notes
writing output... [ 22%] release-notes/version-1.0
writing output... [ 23%] release-notes/version-1.1
writing output... [ 23%] release-notes/version-1.2
writing output... [ 24%] release-notes/version-1.3
writing output... [ 25%] release-notes/version-1.4
writing output... [ 25%] release-notes/version-1.5
writing output... [ 26%] release-notes/version-1.6
writing output... [ 26%] release-notes/version-2.0
writing output... [ 27%] release-notes/version-2.1
writing output... [ 28%] release-notes/version-2.2
writing output... [ 28%] release-notes/version-2.3
writing output... [ 29%] release-notes/version-2.4
writing output... [ 29%] release-notes/version-2.5
writing output... [ 30%] release-notes/version-2.6
writing output... [ 31%] release-notes/version-2.7
writing output... [ 31%] release-notes/version-2.8
writing output... [ 32%] release-notes/version-3.0
writing output... [ 32%] release-notes/version-3.1
writing output... [ 33%] release-notes/version-3.2
writing output... [ 34%] release-notes/version-3.3
writing output... [ 34%] release-notes/version-3.4
writing output... [ 35%] release-notes/version-3.5
writing output... [ 35%] release-notes/version-4.0
writing output... [ 36%] release-notes/version-4.1.0
writing output... [ 37%] release-notes/version-4.1.1
writing output... [ 37%] release-notes/version-4.1.2
writing output... [ 38%] release-notes/version-4.1.3
writing output... [ 38%] release-notes/version-4.2.0
writing output... [ 39%] release-notes/version-4.2.1
writing output... [ 40%] release-notes/version-4.2.2
writing output... [ 40%] release-notes/version-4.2.3
writing output... [ 41%] release-notes/version-4.2.4
writing output... [ 41%] release-notes/version-4.2.5
writing output... [ 42%] release-notes/version-4.2.6
writing output... [ 43%] release-notes/version-4.2.7
writing output... [ 43%] release-notes/version-4.2.8
writing output... [ 44%] release-notes/version-4.3.0
writing output... [ 44%] release-notes/version-4.3.1
writing output... [ 45%] release-notes/version-4.3.2
writing output... [ 46%] release-notes/version-4.4.0
writing output... [ 46%] release-notes/version-4.4.1
writing output... [ 47%] release-notes/version-4.4.10
writing output... [ 47%] release-notes/version-4.4.11
writing output... [ 48%] release-notes/version-4.4.12
writing output... [ 49%] release-notes/version-4.4.13
writing output... [ 49%] release-notes/version-4.4.14
writing output... [ 50%] release-notes/version-4.4.15
writing output... [ 50%] release-notes/version-4.4.16
writing output... [ 51%] release-notes/version-4.4.17
writing output... [ 51%] release-notes/version-4.4.18
writing output... [ 52%] release-notes/version-4.4.19
writing output... [ 53%] release-notes/version-4.4.2
writing output... [ 53%] release-notes/version-4.4.20
writing output... [ 54%] release-notes/version-4.4.21
writing output... [ 54%] release-notes/version-4.4.22
writing output... [ 55%] release-notes/version-4.4.23
writing output... [ 56%] release-notes/version-4.4.3
writing output... [ 56%] release-notes/version-4.4.4
writing output... [ 57%] release-notes/version-4.4.5
writing output... [ 57%] release-notes/version-4.4.6
writing output... [ 58%] release-notes/version-4.4.7
writing output... [ 59%] release-notes/version-4.4.8
writing output... [ 59%] release-notes/version-4.4.9
writing output... [ 60%] release-notes/version-4.5.0
writing output... [ 60%] release-notes/version-4.5.1
writing output... [ 61%] release-notes/version-4.5.10
writing output... [ 62%] release-notes/version-4.5.11
writing output... [ 62%] release-notes/version-4.5.12
writing output... [ 63%] release-notes/version-4.5.13
writing output... [ 63%] release-notes/version-4.5.14
writing output... [ 64%] release-notes/version-4.5.15
writing output... [ 65%] release-notes/version-4.5.16
writing output... [ 65%] release-notes/version-4.5.17
writing output... [ 66%] release-notes/version-4.5.18
writing output... [ 66%] release-notes/version-4.5.19
writing output... [ 67%] release-notes/version-4.5.2
writing output... [ 68%] release-notes/version-4.5.20
writing output... [ 68%] release-notes/version-4.5.21
writing output... [ 69%] release-notes/version-4.5.22
writing output... [ 69%] release-notes/version-4.5.23
writing output... [ 70%] release-notes/version-4.5.24
writing output... [ 71%] release-notes/version-4.5.3
writing output... [ 71%] release-notes/version-4.5.4
writing output... [ 72%] release-notes/version-4.5.5
writing output... [ 72%] release-notes/version-4.5.6
writing output... [ 73%] release-notes/version-4.5.7
writing output... [ 74%] release-notes/version-4.5.8
writing output... [ 74%] release-notes/version-4.5.9
writing output... [ 75%] release-notes/version-4.6.0
writing output... [ 75%] release-notes/version-4.6.1
writing output... [ 76%] release-notes/version-4.6.2
writing output... [ 77%] release-notes/version-4.6.3
writing output... [ 77%] release-notes/version-4.6.4
writing output... [ 78%] release-notes/version-4.6.5
writing output... [ 78%] release-notes/version-4.6.6
writing output... [ 79%] release-notes/version-4.6.7
writing output... [ 80%] release-notes/version-4.6.8
writing output... [ 80%] release-notes/version-4.7.0
writing output... [ 81%] release-notes/version-4.7.1
writing output... [ 81%] release-notes/version-4.8.0
writing output... [ 82%] release-notes/version-4.9.0
writing output... [ 83%] release-notes/version-4.9.1
writing output... [ 83%] release-notes/version-4.9.2
writing output... [ 84%] release-notes/version-4.9.3
writing output... [ 84%] release-notes/version-4.9.4
writing output... [ 85%] release-notes/version-5.0.0
writing output... [ 86%] reporting-bugs
writing output... [ 86%] requirements
writing output... [ 87%] security-issues
writing output... [ 87%] source-code
writing output... [ 88%] troubleshooting
writing output... [ 89%] user-guides
writing output... [ 89%] user-guides/access-control-mechanisms
writing output... [ 90%] user-guides/application-issues
writing output... [ 90%] user-guides/assorted-tips-and-tricks
writing output... [ 91%] user-guides/checking-your-installation
writing output... [ 92%] user-guides/configuration-guidelines
writing output... [ 92%] user-guides/configuration-issues
writing output... [ 93%] user-guides/debugging-techniques
writing output... [ 93%] user-guides/file-wrapper-extension
writing output... [ 94%] user-guides/frequently-asked-questions
writing output... [ 95%] user-guides/installation-issues
writing output... [ 95%] user-guides/installation-on-macosx
writing output... [ 96%] user-guides/issues-with-expat-library
writing output... [ 96%] user-guides/issues-with-pickle-module
writing output... [ 97%] user-guides/processes-and-threading
writing output... [ 98%] user-guides/quick-configuration-guide
writing output... [ 98%] user-guides/quick-installation-guide
writing output... [ 99%] user-guides/registering-cleanup-code
writing output... [ 99%] user-guides/reloading-source-code
writing output... [100%] user-guides/virtual-environments
generating indices... genindex done
writing additional pages... search done
dumping search index in English (code: en)... done
dumping object inventory... done
build succeeded, 4 warnings.

The HTML pages are in _build/html.

Build finished. The HTML pages are in _build/html.
make: Leaving directory '/builddir/build/BUILD/mod_wsgi-5.0.0-build/mod_wsgi-5.0.0/docs'
/builddir/build/BUILD/mod_wsgi-5.0.0-build/mod_wsgi-5.0.0/docs/configuration-directives/WSGIDaemonProcess.rst:729: WARNING: Duplicate explicit target name: "user".
/builddir/build/BUILD/mod_wsgi-5.0.0-build/mod_wsgi-5.0.0/docs/configuration-directives/WSGIDaemonProcess.rst:730: WARNING: Duplicate explicit target name: "group".
/builddir/build/BUILD/mod_wsgi-5.0.0-build/mod_wsgi-5.0.0/docs/configuration-directives/WSGIDaemonProcess.rst:116: ERROR: Duplicate target name, cannot be used as a unique reference: "user".
/builddir/build/BUILD/mod_wsgi-5.0.0-build/mod_wsgi-5.0.0/docs/configuration-directives/WSGIDaemonProcess.rst:133: ERROR: Duplicate target name, cannot be used as a unique reference: "group".
+ export 'LDFLAGS=-Wl,-z,relro -Wl,--as-needed  -Wl,-z,pack-relative-relocs -Wl,-z,now -specs=/usr/lib/rpm/redhat/redhat-hardened-ld -specs=/usr/lib/rpm/redhat/redhat-annobin-cc1  -Wl,--build-id=sha1 -specs=/usr/lib/rpm/redhat/redhat-package-notes  -L/usr/lib64'
+ LDFLAGS='-Wl,-z,relro -Wl,--as-needed  -Wl,-z,pack-relative-relocs -Wl,-z,now -specs=/usr/lib/rpm/redhat/redhat-hardened-ld -specs=/usr/lib/rpm/redhat/redhat-annobin-cc1  -Wl,--build-id=sha1 -specs=/usr/lib/rpm/redhat/redhat-package-notes  -L/usr/lib64'
+ export 'CFLAGS=-O2 -flto=auto -ffat-lto-objects -fexceptions -g -grecord-gcc-switches -pipe -Wall -Wno-complain-wrong-lang -Werror=format-security -Wp,-U_FORTIFY_SOURCE,-D_FORTIFY_SOURCE=3 -Wp,-D_GLIBCXX_ASSERTIONS -specs=/usr/lib/rpm/redhat/redhat-hardened-cc1 -fstack-protector-strong -specs=/usr/lib/rpm/redhat/redhat-annobin-cc1  -m64 -march=x86-64 -mtune=generic -fasynchronous-unwind-tables -fstack-clash-protection -fcf-protection -mtls-dialect=gnu2 -fno-omit-frame-pointer -mno-omit-leaf-frame-pointer -fno-strict-aliasing'
+ CFLAGS='-O2 -flto=auto -ffat-lto-objects -fexceptions -g -grecord-gcc-switches -pipe -Wall -Wno-complain-wrong-lang -Werror=format-security -Wp,-U_FORTIFY_SOURCE,-D_FORTIFY_SOURCE=3 -Wp,-D_GLIBCXX_ASSERTIONS -specs=/usr/lib/rpm/redhat/redhat-hardened-cc1 -fstack-protector-strong -specs=/usr/lib/rpm/redhat/redhat-annobin-cc1  -m64 -march=x86-64 -mtune=generic -fasynchronous-unwind-tables -fstack-clash-protection -fcf-protection -mtls-dialect=gnu2 -fno-omit-frame-pointer -mno-omit-leaf-frame-pointer -fno-strict-aliasing'
+ mkdir py3build/
+ cp -R CREDITS.rst LICENSE MANIFEST.in Makefile.in README-standalone.rst README.rst configure configure.ac docs images package.sh py3build pyproject.toml.in scripts setup.py src tests tox.ini py3build/
cp: cannot copy a directory, 'py3build', into itself, 'py3build/py3build'
+ :
~/build/BUILD/mod_wsgi-5.0.0-build/mod_wsgi-5.0.0/py3build ~/build/BUILD/mod_wsgi-5.0.0-build/mod_wsgi-5.0.0
+ pushd py3build
+ CFLAGS='-O2 -flto=auto -ffat-lto-objects -fexceptions -g -grecord-gcc-switches -pipe -Wall -Wno-complain-wrong-lang -Werror=format-security -Wp,-U_FORTIFY_SOURCE,-D_FORTIFY_SOURCE=3 -Wp,-D_GLIBCXX_ASSERTIONS -specs=/usr/lib/rpm/redhat/redhat-hardened-cc1 -fstack-protector-strong -specs=/usr/lib/rpm/redhat/redhat-annobin-cc1  -m64 -march=x86-64 -mtune=generic -fasynchronous-unwind-tables -fstack-clash-protection -fcf-protection -mtls-dialect=gnu2 -fno-omit-frame-pointer -mno-omit-leaf-frame-pointer -fno-strict-aliasing'
+ export CFLAGS
+ CXXFLAGS='-O2 -flto=auto -ffat-lto-objects -fexceptions -g -grecord-gcc-switches -pipe -Wall -Werror=format-security -Wp,-U_FORTIFY_SOURCE,-D_FORTIFY_SOURCE=3 -Wp,-D_GLIBCXX_ASSERTIONS -specs=/usr/lib/rpm/redhat/redhat-hardened-cc1 -fstack-protector-strong -specs=/usr/lib/rpm/redhat/redhat-annobin-cc1  -m64 -march=x86-64 -mtune=generic -fasynchronous-unwind-tables -fstack-clash-protection -fcf-protection -mtls-dialect=gnu2 -fno-omit-frame-pointer -mno-omit-leaf-frame-pointer '
+ export CXXFLAGS
+ FFLAGS='-O2 -flto=auto -ffat-lto-objects -fexceptions -g -grecord-gcc-switches -pipe -Wall -Wp,-U_FORTIFY_SOURCE,-D_FORTIFY_SOURCE=3 -Wp,-D_GLIBCXX_ASSERTIONS -specs=/usr/lib/rpm/redhat/redhat-hardened-cc1 -fstack-protector-strong -specs=/usr/lib/rpm/redhat/redhat-annobin-cc1  -m64 -march=x86-64 -mtune=generic -fasynchronous-unwind-tables -fstack-clash-protection -fcf-protection -mtls-dialect=gnu2 -fno-omit-frame-pointer -mno-omit-leaf-frame-pointer -I/usr/lib64/gfortran/modules '
+ export FFLAGS
+ FCFLAGS='-O2 -flto=auto -ffat-lto-objects -fexceptions -g -grecord-gcc-switches -pipe -Wall -Wp,-U_FORTIFY_SOURCE,-D_FORTIFY_SOURCE=3 -Wp,-D_GLIBCXX_ASSERTIONS -specs=/usr/lib/rpm/redhat/redhat-hardened-cc1 -fstack-protector-strong -specs=/usr/lib/rpm/redhat/redhat-annobin-cc1  -m64 -march=x86-64 -mtune=generic -fasynchronous-unwind-tables -fstack-clash-protection -fcf-protection -mtls-dialect=gnu2 -fno-omit-frame-pointer -mno-omit-leaf-frame-pointer -I/usr/lib64/gfortran/modules '
+ export FCFLAGS
+ VALAFLAGS=-g
+ export VALAFLAGS
+ RUSTFLAGS='-Copt-level=3 -Cdebuginfo=2 -Ccodegen-units=1 -Cstrip=none -Cforce-frame-pointers=yes -Clink-arg=-specs=/usr/lib/rpm/redhat/redhat-package-notes --cap-lints=warn'
+ export RUSTFLAGS
+ LDFLAGS='-Wl,-z,relro -Wl,--as-needed  -Wl,-z,pack-relative-relocs -Wl,-z,now -specs=/usr/lib/rpm/redhat/redhat-hardened-ld -specs=/usr/lib/rpm/redhat/redhat-annobin-cc1  -Wl,--build-id=sha1 -specs=/usr/lib/rpm/redhat/redhat-package-notes  -L/usr/lib64'
+ export LDFLAGS
+ LT_SYS_LIBRARY_PATH=/usr/lib64:
+ export LT_SYS_LIBRARY_PATH
+ CC=gcc
+ export CC
+ CXX=g++
+ export CXX
+ '[' '-flto=auto -ffat-lto-objectsx' '!=' x ']'
++ find . -type f -name configure -print
+ for file in $(find . -type f -name configure -print)
+ /usr/bin/sed -r --in-place=.backup 's/^char \(\*f\) \(\) = /__attribute__ ((used)) char (*f) () = /g' ./configure
+ diff -u ./configure.backup ./configure
+ mv ./configure.backup ./configure
+ /usr/bin/sed -r --in-place=.backup 's/^char \(\*f\) \(\);/__attribute__ ((used)) char (*f) ();/g' ./configure
+ diff -u ./configure.backup ./configure
+ mv ./configure.backup ./configure
+ /usr/bin/sed -r --in-place=.backup 's/^char \$2 \(\);/__attribute__ ((used)) char \$2 ();/g' ./configure
+ diff -u ./configure.backup ./configure
--- ./configure.backup	2024-07-03 16:13:55.917697875 +0000
+++ ./configure	2024-07-03 16:13:56.563692043 +0000
@@ -1475,7 +1475,7 @@
 #ifdef __cplusplus
 extern "C"
 #endif
-char $2 ();
+__attribute__ ((used)) char $2 ();
 /* The GNU C library defines this for functions which it implements
     to always fail with ENOSYS.  Some functions are actually named
     something starting with __ and the normal name is an alias.  */
+ /usr/bin/sed --in-place=.backup '1{$!N;$!N};$!N;s/int x = 1;\nint y = 0;\nint z;\nint nan;/volatile int x = 1; volatile int y = 0; volatile int z, nan;/;P;D' ./configure
+ diff -u ./configure.backup ./configure
+ mv ./configure.backup ./configure
+ /usr/bin/sed --in-place=.backup 's#^lt_cv_sys_global_symbol_to_cdecl=.*#lt_cv_sys_global_symbol_to_cdecl="sed -n -e '\''s/^T .* \\(.*\\)$/extern int \\1();/p'\'' -e '\''s/^$symcode* .* \\(.*\\)$/extern char \\1;/p'\''"#' ./configure
+ diff -u ./configure.backup ./configure
+ mv ./configure.backup ./configure
+ for file in $(find . -type f -name configure -print)
+ /usr/bin/sed -r --in-place=.backup 's/^char \(\*f\) \(\) = /__attribute__ ((used)) char (*f) () = /g' ./py3build/configure
+ diff -u ./py3build/configure.backup ./py3build/configure
+ mv ./py3build/configure.backup ./py3build/configure
+ /usr/bin/sed -r --in-place=.backup 's/^char \(\*f\) \(\);/__attribute__ ((used)) char (*f) ();/g' ./py3build/configure
+ diff -u ./py3build/configure.backup ./py3build/configure
+ mv ./py3build/configure.backup ./py3build/configure
+ /usr/bin/sed -r --in-place=.backup 's/^char \$2 \(\);/__attribute__ ((used)) char \$2 ();/g' ./py3build/configure
+ diff -u ./py3build/configure.backup ./py3build/configure
--- ./py3build/configure.backup	2024-07-03 16:13:56.552692142 +0000
+++ ./py3build/configure	2024-07-03 16:13:56.579691899 +0000
@@ -1475,7 +1475,7 @@
 #ifdef __cplusplus
 extern "C"
 #endif
-char $2 ();
+__attribute__ ((used)) char $2 ();
 /* The GNU C library defines this for functions which it implements
     to always fail with ENOSYS.  Some functions are actually named
     something starting with __ and the normal name is an alias.  */
+ /usr/bin/sed --in-place=.backup '1{$!N;$!N};$!N;s/int x = 1;\nint y = 0;\nint z;\nint nan;/volatile int x = 1; volatile int y = 0; volatile int z, nan;/;P;D' ./py3build/configure
+ diff -u ./py3build/configure.backup ./py3build/configure
+ mv ./py3build/configure.backup ./py3build/configure
+ /usr/bin/sed --in-place=.backup 's#^lt_cv_sys_global_symbol_to_cdecl=.*#lt_cv_sys_global_symbol_to_cdecl="sed -n -e '\''s/^T .* \\(.*\\)$/extern int \\1();/p'\'' -e '\''s/^$symcode* .* \\(.*\\)$/extern char \\1;/p'\''"#' ./py3build/configure
+ diff -u ./py3build/configure.backup ./py3build/configure
+ mv ./py3build/configure.backup ./py3build/configure
+ '[' 1 = 1 ']'
+++ dirname ./configure
++ find . -name config.guess -o -name config.sub
+ '[' 1 = 1 ']'
+ '[' x '!=' 'x-Wl,-z,now -specs=/usr/lib/rpm/redhat/redhat-hardened-ld' ']'
++ find . -name ltmain.sh
++ grep -q runstatedir=DIR ./configure
+ ./configure --build=x86_64-redhat-linux --host=x86_64-redhat-linux --program-prefix= --disable-dependency-tracking --prefix=/usr --exec-prefix=/usr --bindir=/usr/bin --sbindir=/usr/sbin --sysconfdir=/etc --datadir=/usr/share --includedir=/usr/include --libdir=/usr/lib64 --libexecdir=/usr/libexec --localstatedir=/var --sharedstatedir=/var/lib --mandir=/usr/share/man --infodir=/usr/share/info --enable-shared --with-apxs=/usr/lib64/httpd/build/vendor-apxs --with-python=/usr/bin/python3
configure: WARNING: unrecognized options: --disable-dependency-tracking, --enable-shared
checking for x86_64-redhat-linux-gcc... gcc
checking whether the C compiler works... yes
checking for C compiler default output file name... a.out
checking for suffix of executables... 
checking whether we are cross compiling... no
checking for suffix of object files... o
checking whether we are using the GNU C compiler... yes
checking whether gcc accepts -g... yes
checking for gcc option to accept ISO C89... none needed
checking for prctl... yes
checking Apache version... 2.4.59
configure: creating ./config.status
config.status: creating Makefile
configure: WARNING: unrecognized options: --disable-dependency-tracking, --enable-shared
+ /usr/bin/make -O -j8 V=1 VERBOSE=1
/usr/lib64/httpd/build/vendor-apxs -Wl,-export-symbols-regex -Wl,wsgi_module -c -I/usr/include/python3.13 -DDYNAMIC_ANNOTATIONS_ENABLED=1 -DNDEBUG  -Wc,-O2 -Wc,-flto=auto -Wc,-ffat-lto-objects -Wc,-fexceptions -Wc,-g -Wc,-grecord-gcc-switches -Wc,-pipe -Wc,-Wall -Wc,-Wno-complain-wrong-lang -Wc,-Werror=format-security -Wc,-Wp,-U_FORTIFY_SOURCE,-D_FORTIFY_SOURCE=3 -Wc,-Wp,-D_GLIBCXX_ASSERTIONS -Wc,-specs=/usr/lib/rpm/redhat/redhat-hardened-cc1 -Wc,-fstack-protector-strong -Wc,-specs=/usr/lib/rpm/redhat/redhat-annobin-cc1 -Wc,-m64 -Wc,-march=x86-64 -Wc,-mtune=generic -Wc,-fasynchronous-unwind-tables -Wc,-fstack-clash-protection -Wc,-fcf-protection -Wc,-mtls-dialect=gnu2 -Wc,-fno-omit-frame-pointer -Wc,-mno-omit-leaf-frame-pointer -Wc,-fno-strict-aliasing  src/server/mod_wsgi.c src/server/wsgi_*.c -Wl,-z,relro -Wl,--as-needed  -Wl,-z,pack-relative-relocs -Wl,-z,now -specs=/usr/lib/rpm/redhat/redhat-hardened-ld -specs=/usr/lib/rpm/redhat/redhat-annobin-cc1  -Wl,--build-id=sha1 -specs=/usr/lib/rpm/redhat/redhat-package-notes  -L/usr/lib64 -L/usr/lib64 -L/usr/lib64/python3.13/config  -lpython3.13 -ldl -lm
/usr/lib64/apr-1/build/libtool --silent --mode=compile gcc -prefer-pic -O2 -flto=auto -ffat-lto-objects -fexceptions -g -grecord-gcc-switches -pipe -Wall -Werror=format-security -Wp,-U_FORTIFY_SOURCE,-D_FORTIFY_SOURCE=3 -Wp,-D_GLIBCXX_ASSERTIONS -specs=/usr/lib/rpm/redhat/redhat-hardened-cc1 -fstack-protector-strong -specs=/usr/lib/rpm/redhat/redhat-annobin-cc1 -m64 -march=x86-64 -mtune=generic -fasynchronous-unwind-tables -fstack-clash-protection -fcf-protection -mtls-dialect=gnu2 -fno-omit-frame-pointer -mno-omit-leaf-frame-pointer  -DLINUX -D_REENTRANT -D_GNU_SOURCE  -I/usr/include/httpd  -I/usr/include/apr-1   -I/usr/include/apr-1  -O2 -flto=auto -ffat-lto-objects -fexceptions -g -grecord-gcc-switches -pipe -Wall -Wno-complain-wrong-lang -Werror=format-security -Wp,-U_FORTIFY_SOURCE,-D_FORTIFY_SOURCE=3 -Wp,-D_GLIBCXX_ASSERTIONS -specs=/usr/lib/rpm/redhat/redhat-hardened-cc1 -fstack-protector-strong -specs=/usr/lib/rpm/redhat/redhat-annobin-cc1 -m64 -march=x86-64 -mtune=generic -fasynchronous-unwind-tables -fstack-clash-protection -fcf-protection -mtls-dialect=gnu2 -fno-omit-frame-pointer -mno-omit-leaf-frame-pointer -fno-strict-aliasing -I/usr/include/python3.13 -DDYNAMIC_ANNOTATIONS_ENABLED=1 -DNDEBUG  -c -o src/server/mod_wsgi.lo src/server/mod_wsgi.c && touch src/server/mod_wsgi.slo
/builddir/build/BUILD/mod_wsgi-5.0.0-build/mod_wsgi-5.0.0/py3build/src/server/mod_wsgi.c: In function 'Adapter_environ': <--[gcc]
/builddir/build/BUILD/mod_wsgi-5.0.0-build/mod_wsgi-5.0.0/py3build/src/server/mod_wsgi.c:2633:46: warning: 'Py_FileSystemDefaultEncoding' is deprecated [-Wdeprecated-declarations] <--[gcc]
In file included from /usr/include/python3.13/Python.h:95, <--[gcc]
                 from /builddir/build/BUILD/mod_wsgi-5.0.0-build/mod_wsgi-5.0.0/py3build/src/server/wsgi_python.h:26, <--[gcc]
                 from /builddir/build/BUILD/mod_wsgi-5.0.0-build/mod_wsgi-5.0.0/py3build/src/server/mod_wsgi.c:22: <--[gcc]
/usr/include/python3.13/fileobject.h:22:46: note: declared here <--[gcc]
/builddir/build/BUILD/mod_wsgi-5.0.0-build/mod_wsgi-5.0.0/py3build/src/server/mod_wsgi.c:2638:46: warning: 'Py_FileSystemDefaultEncoding' is deprecated [-Wdeprecated-declarations] <--[gcc]
/usr/include/python3.13/fileobject.h:22:46: note: declared here <--[gcc]
/builddir/build/BUILD/mod_wsgi-5.0.0-build/mod_wsgi-5.0.0/py3build/src/server/mod_wsgi.c: In function 'wsgi_reload_required': <--[gcc]
/builddir/build/BUILD/mod_wsgi-5.0.0-build/mod_wsgi-5.0.0/py3build/src/server/mod_wsgi.c:3862:38: warning: 'Py_FileSystemDefaultEncoding' is deprecated [-Wdeprecated-declarations] <--[gcc]
/usr/include/python3.13/fileobject.h:22:46: note: declared here <--[gcc]
/builddir/build/BUILD/mod_wsgi-5.0.0-build/mod_wsgi-5.0.0/py3build/src/server/mod_wsgi.c: In function 'Adapter_environ': <--[gcc]
/builddir/build/BUILD/mod_wsgi-5.0.0-build/mod_wsgi-5.0.0/py3build/src/server/mod_wsgi.c: In function 'Auth_environ': <--[gcc]
/builddir/build/BUILD/mod_wsgi-5.0.0-build/mod_wsgi-5.0.0/py3build/src/server/mod_wsgi.c:14394:30: warning: 'Py_FileSystemDefaultEncoding' is deprecated [-Wdeprecated-declarations] <--[gcc]
/usr/include/python3.13/fileobject.h:22:46: note: declared here <--[gcc]
cswrap: warning: 2024-07-03 16:14:15 still trying to lock /cswrap_cap_file_lock
/builddir/build/BUILD/mod_wsgi-5.0.0-build/mod_wsgi-5.0.0/py3build/src/server/mod_wsgi.c: internal warning: child 839 timed out after 30s <--[gcc]
cswrap: error: child 839 (/usr/bin/gcc) terminated by signal 15 (timed out)
/builddir/build/BUILD/mod_wsgi-5.0.0-build/mod_wsgi-5.0.0/py3build/src/server/mod_wsgi.c:2633:46: warning: 'Py_FileSystemDefaultEncoding' is deprecated [-Wdeprecated-declarations] <--[gcc]
 2633 |                                              Py_FileSystemDefaultEncoding,
      |                                              ^~~~~~~~~~~~~~~~~~~~~~~~~~~~
In file included from /usr/include/python3.13/Python.h:95, <--[gcc]
                 from /builddir/build/BUILD/mod_wsgi-5.0.0-build/mod_wsgi-5.0.0/py3build/src/server/wsgi_python.h:26, <--[gcc]
                 from /builddir/build/BUILD/mod_wsgi-5.0.0-build/mod_wsgi-5.0.0/py3build/src/server/mod_wsgi.c:22: <--[gcc]
/usr/include/python3.13/fileobject.h:22:46: note: declared here <--[gcc]
   22 | Py_DEPRECATED(3.12) PyAPI_DATA(const char *) Py_FileSystemDefaultEncoding;
      |                                              ^~~~~~~~~~~~~~~~~~~~~~~~~~~~
/builddir/build/BUILD/mod_wsgi-5.0.0-build/mod_wsgi-5.0.0/py3build/src/server/mod_wsgi.c:2638:46: warning: 'Py_FileSystemDefaultEncoding' is deprecated [-Wdeprecated-declarations] <--[gcc]
 2638 |                                              Py_FileSystemDefaultEncoding,
      |                                              ^~~~~~~~~~~~~~~~~~~~~~~~~~~~
/usr/include/python3.13/fileobject.h:22:46: note: declared here <--[gcc]
   22 | Py_DEPRECATED(3.12) PyAPI_DATA(const char *) Py_FileSystemDefaultEncoding;
      |                                              ^~~~~~~~~~~~~~~~~~~~~~~~~~~~
/builddir/build/BUILD/mod_wsgi-5.0.0-build/mod_wsgi-5.0.0/py3build/src/server/mod_wsgi.c: In function 'wsgi_reload_required': <--[gcc]
/builddir/build/BUILD/mod_wsgi-5.0.0-build/mod_wsgi-5.0.0/py3build/src/server/mod_wsgi.c:3862:38: warning: 'Py_FileSystemDefaultEncoding' is deprecated [-Wdeprecated-declarations] <--[gcc]
 3862 |                                      Py_FileSystemDefaultEncoding,
      |                                      ^~~~~~~~~~~~~~~~~~~~~~~~~~~~
/usr/include/python3.13/fileobject.h:22:46: note: declared here <--[gcc]
   22 | Py_DEPRECATED(3.12) PyAPI_DATA(const char *) Py_FileSystemDefaultEncoding;
      |                                              ^~~~~~~~~~~~~~~~~~~~~~~~~~~~
/builddir/build/BUILD/mod_wsgi-5.0.0-build/mod_wsgi-5.0.0/py3build/src/server/mod_wsgi.c: In function 'Auth_environ': <--[gcc]
/builddir/build/BUILD/mod_wsgi-5.0.0-build/mod_wsgi-5.0.0/py3build/src/server/mod_wsgi.c:14394:30: warning: 'Py_FileSystemDefaultEncoding' is deprecated [-Wdeprecated-declarations] <--[gcc]
14394 |                              Py_FileSystemDefaultEncoding,
      |                              ^~~~~~~~~~~~~~~~~~~~~~~~~~~~
/usr/include/python3.13/fileobject.h:22:46: note: declared here <--[gcc]
   22 | Py_DEPRECATED(3.12) PyAPI_DATA(const char *) Py_FileSystemDefaultEncoding;
      |                                              ^~~~~~~~~~~~~~~~~~~~~~~~~~~~
/builddir/build/BUILD/mod_wsgi-5.0.0-build/mod_wsgi-5.0.0/py3build/src/server/mod_wsgi.c: internal warning: child 837 timed out after 30s <--[clang]
cswrap: error: child 837 (/usr/bin/clang) terminated by signal 15 (timed out)
/usr/lib64/apr-1/build/libtool --silent --mode=compile gcc -prefer-pic -O2 -flto=auto -ffat-lto-objects -fexceptions -g -grecord-gcc-switches -pipe -Wall -Werror=format-security -Wp,-U_FORTIFY_SOURCE,-D_FORTIFY_SOURCE=3 -Wp,-D_GLIBCXX_ASSERTIONS -specs=/usr/lib/rpm/redhat/redhat-hardened-cc1 -fstack-protector-strong -specs=/usr/lib/rpm/redhat/redhat-annobin-cc1 -m64 -march=x86-64 -mtune=generic -fasynchronous-unwind-tables -fstack-clash-protection -fcf-protection -mtls-dialect=gnu2 -fno-omit-frame-pointer -mno-omit-leaf-frame-pointer  -DLINUX -D_REENTRANT -D_GNU_SOURCE  -I/usr/include/httpd  -I/usr/include/apr-1   -I/usr/include/apr-1  -O2 -flto=auto -ffat-lto-objects -fexceptions -g -grecord-gcc-switches -pipe -Wall -Wno-complain-wrong-lang -Werror=format-security -Wp,-U_FORTIFY_SOURCE,-D_FORTIFY_SOURCE=3 -Wp,-D_GLIBCXX_ASSERTIONS -specs=/usr/lib/rpm/redhat/redhat-hardened-cc1 -fstack-protector-strong -specs=/usr/lib/rpm/redhat/redhat-annobin-cc1 -m64 -march=x86-64 -mtune=generic -fasynchronous-unwind-tables -fstack-clash-protection -fcf-protection -mtls-dialect=gnu2 -fno-omit-frame-pointer -mno-omit-leaf-frame-pointer -fno-strict-aliasing -I/usr/include/python3.13 -DDYNAMIC_ANNOTATIONS_ENABLED=1 -DNDEBUG  -c -o src/server/wsgi_apache.lo src/server/wsgi_apache.c && touch src/server/wsgi_apache.slo
/usr/lib64/apr-1/build/libtool --silent --mode=compile gcc -prefer-pic -O2 -flto=auto -ffat-lto-objects -fexceptions -g -grecord-gcc-switches -pipe -Wall -Werror=format-security -Wp,-U_FORTIFY_SOURCE,-D_FORTIFY_SOURCE=3 -Wp,-D_GLIBCXX_ASSERTIONS -specs=/usr/lib/rpm/redhat/redhat-hardened-cc1 -fstack-protector-strong -specs=/usr/lib/rpm/redhat/redhat-annobin-cc1 -m64 -march=x86-64 -mtune=generic -fasynchronous-unwind-tables -fstack-clash-protection -fcf-protection -mtls-dialect=gnu2 -fno-omit-frame-pointer -mno-omit-leaf-frame-pointer  -DLINUX -D_REENTRANT -D_GNU_SOURCE  -I/usr/include/httpd  -I/usr/include/apr-1   -I/usr/include/apr-1  -O2 -flto=auto -ffat-lto-objects -fexceptions -g -grecord-gcc-switches -pipe -Wall -Wno-complain-wrong-lang -Werror=format-security -Wp,-U_FORTIFY_SOURCE,-D_FORTIFY_SOURCE=3 -Wp,-D_GLIBCXX_ASSERTIONS -specs=/usr/lib/rpm/redhat/redhat-hardened-cc1 -fstack-protector-strong -specs=/usr/lib/rpm/redhat/redhat-annobin-cc1 -m64 -march=x86-64 -mtune=generic -fasynchronous-unwind-tables -fstack-clash-protection -fcf-protection -mtls-dialect=gnu2 -fno-omit-frame-pointer -mno-omit-leaf-frame-pointer -fno-strict-aliasing -I/usr/include/python3.13 -DDYNAMIC_ANNOTATIONS_ENABLED=1 -DNDEBUG  -c -o src/server/wsgi_buckets.lo src/server/wsgi_buckets.c && touch src/server/wsgi_buckets.slo
/usr/lib64/apr-1/build/libtool --silent --mode=compile gcc -prefer-pic -O2 -flto=auto -ffat-lto-objects -fexceptions -g -grecord-gcc-switches -pipe -Wall -Werror=format-security -Wp,-U_FORTIFY_SOURCE,-D_FORTIFY_SOURCE=3 -Wp,-D_GLIBCXX_ASSERTIONS -specs=/usr/lib/rpm/redhat/redhat-hardened-cc1 -fstack-protector-strong -specs=/usr/lib/rpm/redhat/redhat-annobin-cc1 -m64 -march=x86-64 -mtune=generic -fasynchronous-unwind-tables -fstack-clash-protection -fcf-protection -mtls-dialect=gnu2 -fno-omit-frame-pointer -mno-omit-leaf-frame-pointer  -DLINUX -D_REENTRANT -D_GNU_SOURCE  -I/usr/include/httpd  -I/usr/include/apr-1   -I/usr/include/apr-1  -O2 -flto=auto -ffat-lto-objects -fexceptions -g -grecord-gcc-switches -pipe -Wall -Wno-complain-wrong-lang -Werror=format-security -Wp,-U_FORTIFY_SOURCE,-D_FORTIFY_SOURCE=3 -Wp,-D_GLIBCXX_ASSERTIONS -specs=/usr/lib/rpm/redhat/redhat-hardened-cc1 -fstack-protector-strong -specs=/usr/lib/rpm/redhat/redhat-annobin-cc1 -m64 -march=x86-64 -mtune=generic -fasynchronous-unwind-tables -fstack-clash-protection -fcf-protection -mtls-dialect=gnu2 -fno-omit-frame-pointer -mno-omit-leaf-frame-pointer -fno-strict-aliasing -I/usr/include/python3.13 -DDYNAMIC_ANNOTATIONS_ENABLED=1 -DNDEBUG  -c -o src/server/wsgi_convert.lo src/server/wsgi_convert.c && touch src/server/wsgi_convert.slo
/usr/lib64/apr-1/build/libtool --silent --mode=compile gcc -prefer-pic -O2 -flto=auto -ffat-lto-objects -fexceptions -g -grecord-gcc-switches -pipe -Wall -Werror=format-security -Wp,-U_FORTIFY_SOURCE,-D_FORTIFY_SOURCE=3 -Wp,-D_GLIBCXX_ASSERTIONS -specs=/usr/lib/rpm/redhat/redhat-hardened-cc1 -fstack-protector-strong -specs=/usr/lib/rpm/redhat/redhat-annobin-cc1 -m64 -march=x86-64 -mtune=generic -fasynchronous-unwind-tables -fstack-clash-protection -fcf-protection -mtls-dialect=gnu2 -fno-omit-frame-pointer -mno-omit-leaf-frame-pointer  -DLINUX -D_REENTRANT -D_GNU_SOURCE  -I/usr/include/httpd  -I/usr/include/apr-1   -I/usr/include/apr-1  -O2 -flto=auto -ffat-lto-objects -fexceptions -g -grecord-gcc-switches -pipe -Wall -Wno-complain-wrong-lang -Werror=format-security -Wp,-U_FORTIFY_SOURCE,-D_FORTIFY_SOURCE=3 -Wp,-D_GLIBCXX_ASSERTIONS -specs=/usr/lib/rpm/redhat/redhat-hardened-cc1 -fstack-protector-strong -specs=/usr/lib/rpm/redhat/redhat-annobin-cc1 -m64 -march=x86-64 -mtune=generic -fasynchronous-unwind-tables -fstack-clash-protection -fcf-protection -mtls-dialect=gnu2 -fno-omit-frame-pointer -mno-omit-leaf-frame-pointer -fno-strict-aliasing -I/usr/include/python3.13 -DDYNAMIC_ANNOTATIONS_ENABLED=1 -DNDEBUG  -c -o src/server/wsgi_daemon.lo src/server/wsgi_daemon.c && touch src/server/wsgi_daemon.slo
/usr/lib64/apr-1/build/libtool --silent --mode=compile gcc -prefer-pic -O2 -flto=auto -ffat-lto-objects -fexceptions -g -grecord-gcc-switches -pipe -Wall -Werror=format-security -Wp,-U_FORTIFY_SOURCE,-D_FORTIFY_SOURCE=3 -Wp,-D_GLIBCXX_ASSERTIONS -specs=/usr/lib/rpm/redhat/redhat-hardened-cc1 -fstack-protector-strong -specs=/usr/lib/rpm/redhat/redhat-annobin-cc1 -m64 -march=x86-64 -mtune=generic -fasynchronous-unwind-tables -fstack-clash-protection -fcf-protection -mtls-dialect=gnu2 -fno-omit-frame-pointer -mno-omit-leaf-frame-pointer  -DLINUX -D_REENTRANT -D_GNU_SOURCE  -I/usr/include/httpd  -I/usr/include/apr-1   -I/usr/include/apr-1  -O2 -flto=auto -ffat-lto-objects -fexceptions -g -grecord-gcc-switches -pipe -Wall -Wno-complain-wrong-lang -Werror=format-security -Wp,-U_FORTIFY_SOURCE,-D_FORTIFY_SOURCE=3 -Wp,-D_GLIBCXX_ASSERTIONS -specs=/usr/lib/rpm/redhat/redhat-hardened-cc1 -fstack-protector-strong -specs=/usr/lib/rpm/redhat/redhat-annobin-cc1 -m64 -march=x86-64 -mtune=generic -fasynchronous-unwind-tables -fstack-clash-protection -fcf-protection -mtls-dialect=gnu2 -fno-omit-frame-pointer -mno-omit-leaf-frame-pointer -fno-strict-aliasing -I/usr/include/python3.13 -DDYNAMIC_ANNOTATIONS_ENABLED=1 -DNDEBUG  -c -o src/server/wsgi_interp.lo src/server/wsgi_interp.c && touch src/server/wsgi_interp.slo
/builddir/build/BUILD/mod_wsgi-5.0.0-build/mod_wsgi-5.0.0/py3build/src/server/wsgi_interp.c: In function 'newInterpreterObject': <--[gcc]
/builddir/build/BUILD/mod_wsgi-5.0.0-build/mod_wsgi-5.0.0/py3build/src/server/wsgi_interp.c:733:46: warning: 'Py_FileSystemDefaultEncoding' is deprecated [-Wdeprecated-declarations] <--[gcc]
In file included from /usr/include/python3.13/Python.h:95, <--[gcc]
                 from /builddir/build/BUILD/mod_wsgi-5.0.0-build/mod_wsgi-5.0.0/py3build/src/server/wsgi_python.h:26, <--[gcc]
                 from /builddir/build/BUILD/mod_wsgi-5.0.0-build/mod_wsgi-5.0.0/py3build/src/server/wsgi_interp.h:24, <--[gcc]
                 from /builddir/build/BUILD/mod_wsgi-5.0.0-build/mod_wsgi-5.0.0/py3build/src/server/wsgi_interp.c:21: <--[gcc]
/usr/include/python3.13/fileobject.h:22:46: note: declared here <--[gcc]
/builddir/build/BUILD/mod_wsgi-5.0.0-build/mod_wsgi-5.0.0/py3build/src/server/wsgi_interp.c:751:46: warning: 'Py_FileSystemDefaultEncoding' is deprecated [-Wdeprecated-declarations] <--[gcc]
/usr/include/python3.13/fileobject.h:22:46: note: declared here <--[gcc]
/builddir/build/BUILD/mod_wsgi-5.0.0-build/mod_wsgi-5.0.0/py3build/src/server/wsgi_interp.c:769:46: warning: 'Py_FileSystemDefaultEncoding' is deprecated [-Wdeprecated-declarations] <--[gcc]
/usr/include/python3.13/fileobject.h:22:46: note: declared here <--[gcc]
/builddir/build/BUILD/mod_wsgi-5.0.0-build/mod_wsgi-5.0.0/py3build/src/server/wsgi_interp.c:821:46: warning: 'Py_FileSystemDefaultEncoding' is deprecated [-Wdeprecated-declarations] <--[gcc]
/usr/include/python3.13/fileobject.h:22:46: note: declared here <--[gcc]
/builddir/build/BUILD/mod_wsgi-5.0.0-build/mod_wsgi-5.0.0/py3build/src/server/wsgi_interp.c:867:42: warning: 'Py_FileSystemDefaultEncoding' is deprecated [-Wdeprecated-declarations] <--[gcc]
/usr/include/python3.13/fileobject.h:22:46: note: declared here <--[gcc]
/builddir/build/BUILD/mod_wsgi-5.0.0-build/mod_wsgi-5.0.0/py3build/src/server/wsgi_interp.c:1139:37: warning: 'Py_FileSystemDefaultEncoding' is deprecated [-Wdeprecated-declarations] <--[gcc]
/usr/include/python3.13/fileobject.h:22:46: note: declared here <--[gcc]
/builddir/build/BUILD/mod_wsgi-5.0.0-build/mod_wsgi-5.0.0/py3build/src/server/wsgi_interp.c:1468:26: warning: 'Py_FileSystemDefaultEncoding' is deprecated [-Wdeprecated-declarations] <--[gcc]
/usr/include/python3.13/fileobject.h:22:46: note: declared here <--[gcc]
/builddir/build/BUILD/mod_wsgi-5.0.0-build/mod_wsgi-5.0.0/py3build/src/server/wsgi_interp.c:1478:29: warning: 'Py_FileSystemDefaultEncoding' is deprecated [-Wdeprecated-declarations] <--[gcc]
/usr/include/python3.13/fileobject.h:22:46: note: declared here <--[gcc]
/builddir/build/BUILD/mod_wsgi-5.0.0-build/mod_wsgi-5.0.0/py3build/src/server/wsgi_interp.c: In function 'wsgi_python_init': <--[gcc]
/builddir/build/BUILD/mod_wsgi-5.0.0-build/mod_wsgi-5.0.0/py3build/src/server/wsgi_interp.c:2190:13: warning: 'Py_DontWriteBytecodeFlag' is deprecated [-Wdeprecated-declarations] <--[gcc]
In file included from /usr/include/python3.13/Python.h:72: <--[gcc]
/usr/include/python3.13/cpython/pydebug.h:18:37: note: declared here <--[gcc]
/builddir/build/BUILD/mod_wsgi-5.0.0-build/mod_wsgi-5.0.0/py3build/src/server/wsgi_interp.c:2196:13: warning: 'Py_OptimizeFlag' is deprecated [-Wdeprecated-declarations] <--[gcc]
/usr/include/python3.13/cpython/pydebug.h:13:37: note: declared here <--[gcc]
/builddir/build/BUILD/mod_wsgi-5.0.0-build/mod_wsgi-5.0.0/py3build/src/server/wsgi_interp.c:2198:13: warning: 'Py_OptimizeFlag' is deprecated [-Wdeprecated-declarations] <--[gcc]
/usr/include/python3.13/cpython/pydebug.h:13:37: note: declared here <--[gcc]
/builddir/build/BUILD/mod_wsgi-5.0.0-build/mod_wsgi-5.0.0/py3build/src/server/wsgi_interp.c: In function 'newInterpreterObject': <--[gcc]
/builddir/build/BUILD/mod_wsgi-5.0.0-build/mod_wsgi-5.0.0/py3build/src/server/wsgi_interp.c:2223:17: error: implicit declaration of function 'PySys_AddWarnOption'; did you mean 'PySys_ResetWarnOptions'? [-Wimplicit-function-declaration] <--[gcc]
/builddir/build/BUILD/mod_wsgi-5.0.0-build/mod_wsgi-5.0.0/py3build/src/server/wsgi_interp.c:2384:17: warning: 'Py_SetProgramName' is deprecated [-Wdeprecated-declarations] <--[gcc]
In file included from /usr/include/python3.13/Python.h:119: <--[gcc]
/usr/include/python3.13/pylifecycle.h:37:38: note: declared here <--[gcc]
/builddir/build/BUILD/mod_wsgi-5.0.0-build/mod_wsgi-5.0.0/py3build/src/server/wsgi_interp.c:2399:17: warning: 'Py_SetPythonHome' is deprecated [-Wdeprecated-declarations] <--[gcc]
/usr/include/python3.13/pylifecycle.h:40:38: note: declared here <--[gcc]
/builddir/build/BUILD/mod_wsgi-5.0.0-build/mod_wsgi-5.0.0/py3build/src/server/wsgi_interp.c:733:46: warning: 'Py_FileSystemDefaultEncoding' is deprecated [-Wdeprecated-declarations] <--[gcc]
  733 |                                              Py_FileSystemDefaultEncoding,
      |                                              ^~~~~~~~~~~~~~~~~~~~~~~~~~~~
In file included from /usr/include/python3.13/Python.h:95, <--[gcc]
                 from /builddir/build/BUILD/mod_wsgi-5.0.0-build/mod_wsgi-5.0.0/py3build/src/server/wsgi_python.h:26, <--[gcc]
                 from /builddir/build/BUILD/mod_wsgi-5.0.0-build/mod_wsgi-5.0.0/py3build/src/server/wsgi_interp.h:24, <--[gcc]
                 from /builddir/build/BUILD/mod_wsgi-5.0.0-build/mod_wsgi-5.0.0/py3build/src/server/wsgi_interp.c:21: <--[gcc]
/usr/include/python3.13/fileobject.h:22:46: note: declared here <--[gcc]
   22 | Py_DEPRECATED(3.12) PyAPI_DATA(const char *) Py_FileSystemDefaultEncoding;
      |                                              ^~~~~~~~~~~~~~~~~~~~~~~~~~~~
/builddir/build/BUILD/mod_wsgi-5.0.0-build/mod_wsgi-5.0.0/py3build/src/server/wsgi_interp.c:751:46: warning: 'Py_FileSystemDefaultEncoding' is deprecated [-Wdeprecated-declarations] <--[gcc]
  751 |                                              Py_FileSystemDefaultEncoding,
      |                                              ^~~~~~~~~~~~~~~~~~~~~~~~~~~~
/usr/include/python3.13/fileobject.h:22:46: note: declared here <--[gcc]
   22 | Py_DEPRECATED(3.12) PyAPI_DATA(const char *) Py_FileSystemDefaultEncoding;
      |                                              ^~~~~~~~~~~~~~~~~~~~~~~~~~~~
/builddir/build/BUILD/mod_wsgi-5.0.0-build/mod_wsgi-5.0.0/py3build/src/server/wsgi_interp.c:769:46: warning: 'Py_FileSystemDefaultEncoding' is deprecated [-Wdeprecated-declarations] <--[gcc]
  769 |                                              Py_FileSystemDefaultEncoding,
      |                                              ^~~~~~~~~~~~~~~~~~~~~~~~~~~~
/usr/include/python3.13/fileobject.h:22:46: note: declared here <--[gcc]
   22 | Py_DEPRECATED(3.12) PyAPI_DATA(const char *) Py_FileSystemDefaultEncoding;
      |                                              ^~~~~~~~~~~~~~~~~~~~~~~~~~~~
/builddir/build/BUILD/mod_wsgi-5.0.0-build/mod_wsgi-5.0.0/py3build/src/server/wsgi_interp.c:821:46: warning: 'Py_FileSystemDefaultEncoding' is deprecated [-Wdeprecated-declarations] <--[gcc]
  821 |                                              Py_FileSystemDefaultEncoding,
      |                                              ^~~~~~~~~~~~~~~~~~~~~~~~~~~~
/usr/include/python3.13/fileobject.h:22:46: note: declared here <--[gcc]
   22 | Py_DEPRECATED(3.12) PyAPI_DATA(const char *) Py_FileSystemDefaultEncoding;
      |                                              ^~~~~~~~~~~~~~~~~~~~~~~~~~~~
/builddir/build/BUILD/mod_wsgi-5.0.0-build/mod_wsgi-5.0.0/py3build/src/server/wsgi_interp.c:867:42: warning: 'Py_FileSystemDefaultEncoding' is deprecated [-Wdeprecated-declarations] <--[gcc]
  867 |                                          Py_FileSystemDefaultEncoding,
      |                                          ^~~~~~~~~~~~~~~~~~~~~~~~~~~~
/usr/include/python3.13/fileobject.h:22:46: note: declared here <--[gcc]
   22 | Py_DEPRECATED(3.12) PyAPI_DATA(const char *) Py_FileSystemDefaultEncoding;
      |                                              ^~~~~~~~~~~~~~~~~~~~~~~~~~~~
/builddir/build/BUILD/mod_wsgi-5.0.0-build/mod_wsgi-5.0.0/py3build/src/server/wsgi_interp.c:1139:37: warning: 'Py_FileSystemDefaultEncoding' is deprecated [-Wdeprecated-declarations] <--[gcc]
 1139 |                                     Py_FileSystemDefaultEncoding,
      |                                     ^~~~~~~~~~~~~~~~~~~~~~~~~~~~
/usr/include/python3.13/fileobject.h:22:46: note: declared here <--[gcc]
   22 | Py_DEPRECATED(3.12) PyAPI_DATA(const char *) Py_FileSystemDefaultEncoding;
      |                                              ^~~~~~~~~~~~~~~~~~~~~~~~~~~~
/builddir/build/BUILD/mod_wsgi-5.0.0-build/mod_wsgi-5.0.0/py3build/src/server/wsgi_interp.c:1468:26: warning: 'Py_FileSystemDefaultEncoding' is deprecated [-Wdeprecated-declarations] <--[gcc]
 1468 |                          Py_FileSystemDefaultEncoding,
      |                          ^~~~~~~~~~~~~~~~~~~~~~~~~~~~
/usr/include/python3.13/fileobject.h:22:46: note: declared here <--[gcc]
   22 | Py_DEPRECATED(3.12) PyAPI_DATA(const char *) Py_FileSystemDefaultEncoding;
      |                                              ^~~~~~~~~~~~~~~~~~~~~~~~~~~~
/builddir/build/BUILD/mod_wsgi-5.0.0-build/mod_wsgi-5.0.0/py3build/src/server/wsgi_interp.c:1478:29: warning: 'Py_FileSystemDefaultEncoding' is deprecated [-Wdeprecated-declarations] <--[gcc]
 1478 |                             Py_FileSystemDefaultEncoding,
      |                             ^~~~~~~~~~~~~~~~~~~~~~~~~~~~
/usr/include/python3.13/fileobject.h:22:46: note: declared here <--[gcc]
   22 | Py_DEPRECATED(3.12) PyAPI_DATA(const char *) Py_FileSystemDefaultEncoding;
      |                                              ^~~~~~~~~~~~~~~~~~~~~~~~~~~~
/builddir/build/BUILD/mod_wsgi-5.0.0-build/mod_wsgi-5.0.0/py3build/src/server/wsgi_interp.c: In function 'wsgi_python_init': <--[gcc]
/builddir/build/BUILD/mod_wsgi-5.0.0-build/mod_wsgi-5.0.0/py3build/src/server/wsgi_interp.c:2190:13: warning: 'Py_DontWriteBytecodeFlag' is deprecated [-Wdeprecated-declarations] <--[gcc]
 2190 |             Py_DontWriteBytecodeFlag++;
      |             ^~~~~~~~~~~~~~~~~~~~~~~~
In file included from /usr/include/python3.13/Python.h:72: <--[gcc]
/usr/include/python3.13/cpython/pydebug.h:18:37: note: declared here <--[gcc]
   18 | Py_DEPRECATED(3.12) PyAPI_DATA(int) Py_DontWriteBytecodeFlag;
      |                                     ^~~~~~~~~~~~~~~~~~~~~~~~
/builddir/build/BUILD/mod_wsgi-5.0.0-build/mod_wsgi-5.0.0/py3build/src/server/wsgi_interp.c:2196:13: warning: 'Py_OptimizeFlag' is deprecated [-Wdeprecated-declarations] <--[gcc]
 2196 |             Py_OptimizeFlag = wsgi_server_config->python_optimize;
      |             ^~~~~~~~~~~~~~~
/usr/include/python3.13/cpython/pydebug.h:13:37: note: declared here <--[gcc]
   13 | Py_DEPRECATED(3.12) PyAPI_DATA(int) Py_OptimizeFlag;
      |                                     ^~~~~~~~~~~~~~~
/builddir/build/BUILD/mod_wsgi-5.0.0-build/mod_wsgi-5.0.0/py3build/src/server/wsgi_interp.c:2198:13: warning: 'Py_OptimizeFlag' is deprecated [-Wdeprecated-declarations] <--[gcc]
 2198 |             Py_OptimizeFlag = 0;
      |             ^~~~~~~~~~~~~~~
/usr/include/python3.13/cpython/pydebug.h:13:37: note: declared here <--[gcc]
   13 | Py_DEPRECATED(3.12) PyAPI_DATA(int) Py_OptimizeFlag;
      |                                     ^~~~~~~~~~~~~~~
/builddir/build/BUILD/mod_wsgi-5.0.0-build/mod_wsgi-5.0.0/py3build/src/server/wsgi_interp.c:2223:17: error: implicit declaration of function 'PySys_AddWarnOption'; did you mean 'PySys_ResetWarnOptions'? [-Wimplicit-function-declaration] <--[gcc]
 2223 |                 PySys_AddWarnOption(s);
      |                 ^~~~~~~~~~~~~~~~~~~
      |                 PySys_ResetWarnOptions
/builddir/build/BUILD/mod_wsgi-5.0.0-build/mod_wsgi-5.0.0/py3build/src/server/wsgi_interp.c:2223:17: error: call to undeclared function 'PySys_AddWarnOption'; ISO C99 and later do not support implicit function declarations [-Wimplicit-function-declaration] <--[clang]
/builddir/build/BUILD/mod_wsgi-5.0.0-build/mod_wsgi-5.0.0/py3build/src/server/wsgi_interp.c:2384:17: warning: 'Py_SetProgramName' is deprecated [-Wdeprecated-declarations] <--[gcc]
 2384 |                 Py_SetProgramName(s);
      |                 ^~~~~~~~~~~~~~~~~
In file included from /usr/include/python3.13/Python.h:119: <--[gcc]
/usr/include/python3.13/pylifecycle.h:37:38: note: declared here <--[gcc]
   37 | Py_DEPRECATED(3.11) PyAPI_FUNC(void) Py_SetProgramName(const wchar_t *);
      |                                      ^~~~~~~~~~~~~~~~~
/builddir/build/BUILD/mod_wsgi-5.0.0-build/mod_wsgi-5.0.0/py3build/src/server/wsgi_interp.c:2399:17: warning: 'Py_SetPythonHome' is deprecated [-Wdeprecated-declarations] <--[gcc]
 2399 |                 Py_SetPythonHome(s);
      |                 ^~~~~~~~~~~~~~~~
/usr/include/python3.13/pylifecycle.h:40:38: note: declared here <--[gcc]
   40 | Py_DEPRECATED(3.11) PyAPI_FUNC(void) Py_SetPythonHome(const wchar_t *);
      |                                      ^~~~~~~~~~~~~~~~
apxs:Error: Command failed with rc=65536
.
make: *** [Makefile:31: src/server/mod_wsgi.la] Error 1

RPM build errors:
error: Bad exit status from /var/tmp/rpm-tmp.7ETMHl (%build)
    Bad exit status from /var/tmp/rpm-tmp.7ETMHl (%build)
Finish: chroot ['/bin/su mockbuild -l -c "PATH=/usr/lib64/cscppc:/usr/lib64/csclng:/usr/lib64/csgcca:/usr/lib64/cswrap:\\$PATH CSWRAP_CAP_FILE=\\$\'/builddir/cswrap-capture.err\' CSWRAP_TIMEOUT=\\$\'30\' CSWRAP_TIMEOUT_FOR=\\$\'::clang:clang++:cppcheck:gcc\' CSWRAP_ADD_CFLAGS=\\$\'-Wno-unknown-pragmas\' CSWRAP_DEL_CFLAGS=\\$\'-Werror*:-fdiagnostics-color*:-no-canonical-prefixes:-Wno-error=deprecated-register\' CSWRAP_ADD_CXXFLAGS=\\$\'\' CSWRAP_DEL_CXXFLAGS=\\$\'-Werror*:-fdiagnostics-color*:-no-canonical-prefixes:-Wno-error=deprecated-register\' sh -c \\"rpmbuild -bc --nodeps --short-circuit /builddir/build/SPECS/mod_wsgi.spec \'--define\' \'_unpackaged_files_terminate_build 0\' \'--define\' \'apidocs 0\' \'--define\' \'with_publican 0\' \'--without\' \'docs\' \'--without\' \'langpacks\'\\""']
Finish: run

!!! 2024-07-03 16:14:28	error: %build failed

>>> 2024-07-03 16:14:28	"/usr/bin/mock" "-r" "fedora-41-x86_64" "--plugin-option=tmpfs:keep_mounted=True" "--config-opts=print_main_output=True" "--quiet" "--clean"

scan.ini: time-finished = 2024-07-03 16:14:30
scan.ini: exit-code = 1
<<< 2024-07-03 16:14:30	csmock exit code: 1

Wrote: /tmp/tmpnwuxjk25/mod_wsgi-5.0.0-1.fc40.tar.xz

ERROR running command: su - csmock --session-command 'cd /tmp/tmpnwuxjk25 && csmock -r fedora-41-x86_64 -t cppcheck,gcc,clang,shellcheck -o /tmp/tmpnwuxjk25/mod_wsgi-5.0.0-1.fc40.tar.xz --gcc-analyze /tmp/tmpnwuxjk25/mod_wsgi-5.0.0-1.fc40.src.rpm'
Scanning has not completed successfully (1)